check-n
type: LexicalEntry
canonical form: check
sense: 00142626-n
part of speech: noun
sense: 00168267-n
sense: 00563972-n
sense: 01148552-n
sense: 03014816-n
sense: 04700256-n
sense: 05697054-n
sense: 05746570-n
sense: 05833569-n
sense: 06529933-n
sense: 06831605-n
sense: 13402907-n
sense: 14034398-n

checkout-n
type: LexicalEntry
canonical form: checkout
sense: 00142626-n
part of speech: noun

check-out procedure-n
type: LexicalEntry
canonical form: check-out procedure
sense: 00142626-n
part of speech: noun

00142626-n
type: LexicalConcept
in scheme: en-word.net
definition: the act of inspecting or verifying
example: they made a check of their equipment
example: the pilot ran through the check-out procedure
ili: i36160
lexfile: noun.act
part of speech: noun
hypernym: 00880949-n

00168267-n
type: LexicalConcept
in scheme: en-word.net
definition: (chess) a direct attack on an opponent's king
ili: i36289
lexfile: noun.act
part of speech: noun
domain topic: 00504248-n
hypernym: 00167176-n

crack-v
type: LexicalEntry
canonical form: crack
sense: 00337070-v
part of speech: verb

check-v
type: LexicalEntry
canonical form: check
sense: 00337070-v
part of speech: verb
sense: 00337349-v
sense: 00355288-v
sense: 00441241-v
sense: 00663742-v
sense: 00664100-v
sense: 00664507-v
sense: 00665271-v
sense: 00922307-v
sense: 01067021-v
sense: 01117182-v
sense: 01133899-v
sense: 01142182-v
sense: 01696873-v
sense: 01865389-v
sense: 01865608-v
sense: 01865753-v
sense: 02352443-v
sense: 02352901-v
sense: 02516039-v
sense: 02538948-v
sense: 02559394-v
sense: 02563464-v
sense: 02663315-v
sense: 02664361-v

break-v
type: LexicalEntry
canonical form: break
sense: 00337070-v
part of speech: verb

00337070-v
type: LexicalConcept
in scheme: en-word.net
definition: become fractured; break or crack on the surface only
example: The glass cracked when it was heated
ili: i23416
lexfile: verb.change
part of speech: verb
hypernym: 00109468-v
similar: 00337349-v
similar: 00337528-v

chink-v
type: LexicalEntry
canonical form: chink
sense: 00337349-v
part of speech: verb

00337349-v
type: LexicalConcept
in scheme: en-word.net
definition: make cracks or chinks in
example: The heat checked the paint
ili: i23417
lexfile: verb.change
part of speech: verb
hypernym: 00337528-v
similar: 00337070-v

00355288-v
type: LexicalConcept
in scheme: en-word.net
definition: arrest the motion (of something) abruptly
example: He checked the flow of water by shutting off the main valve
ili: i23509
lexfile: verb.change
part of speech: verb
hypernym: 01863207-v

retard-v
type: LexicalEntry
canonical form: retard
sense: 00441241-v
part of speech: verb

delay-v
type: LexicalEntry
canonical form: delay
sense: 00441241-v
part of speech: verb

00441241-v
type: LexicalConcept
in scheme: en-word.net
definition: slow the growth or development of
example: The brain damage will retard the child's language development
ili: i23927
lexfile: verb.change
part of speech: verb
hypernym: 00126072-v

00563972-n
type: LexicalConcept
in scheme: en-word.net
definition: obstructing an opponent in ice hockey
ili: i38350
lexfile: noun.act
part of speech: noun
hypernym: 00563317-n

check up on-v
type: LexicalEntry
canonical form: check up on
sense: 00663742-v
part of speech: verb

look into-v
type: LexicalEntry
canonical form: look into
sense: 00663742-v
part of speech: verb

check out-v
type: LexicalEntry
canonical form: check out
sense: 00663742-v
part of speech: verb
sense: 02664361-v

suss out-v
type: LexicalEntry
canonical form: suss out
sense: 00663742-v
part of speech: verb

check over-v
type: LexicalEntry
canonical form: check over
sense: 00663742-v
part of speech: verb

go over-v
type: LexicalEntry
canonical form: go over
sense: 00663742-v
part of speech: verb

check into-v
type: LexicalEntry
canonical form: check into
sense: 00663742-v
part of speech: verb

00663742-v
type: LexicalConcept
in scheme: en-word.net
definition: examine so as to determine accuracy, quality, or condition
example: check the brakes
example: Check out the engine
ili: i25036
lexfile: verb.cognition
part of speech: verb
hypernym: 00646245-v
similar: 00664100-v

check off-v
type: LexicalEntry
canonical form: check off
sense: 00664100-v
part of speech: verb

mark-v
type: LexicalEntry
canonical form: mark
sense: 00664100-v
part of speech: verb

mark off-v
type: LexicalEntry
canonical form: mark off
sense: 00664100-v
part of speech: verb

tick off-v
type: LexicalEntry
canonical form: tick off
sense: 00664100-v
part of speech: verb

tick-v
type: LexicalEntry
canonical form: tick
sense: 00664100-v
part of speech: verb

00664100-v
type: LexicalConcept
in scheme: en-word.net
definition: put a check mark on or near or next to
example: Please check each name on the list
example: tick off the items
example: mark off the units
ili: i25037
lexfile: verb.cognition
part of speech: verb
hypernym: 00666401-v
similar: 00663742-v
similar: 00664507-v

see-v
type: LexicalEntry
canonical form: see
sense: 00664507-v
part of speech: verb
sense: 00922307-v

insure-v
type: LexicalEntry
canonical form: insure
sense: 00664507-v
part of speech: verb

see to it-v
type: LexicalEntry
canonical form: see to it
sense: 00664507-v
part of speech: verb

ensure-v
type: LexicalEntry
canonical form: ensure
sense: 00664507-v
part of speech: verb

control-v
type: LexicalEntry
canonical form: control
sense: 00664507-v
part of speech: verb
sense: 02516039-v

ascertain-v
type: LexicalEntry
canonical form: ascertain
sense: 00664507-v
part of speech: verb
sense: 00922307-v

assure-v
type: LexicalEntry
canonical form: assure
sense: 00664507-v
part of speech: verb

00664507-v
type: LexicalConcept
in scheme: en-word.net
definition: be careful or certain to do something; make certain of something
example: He verified that the valves were closed
example: See that the curtains are closed
example: control the quality of the product
ili: i25039
lexfile: verb.cognition
part of speech: verb
hypernym: 00666401-v
similar: 00922307-v
similar: 00664100-v
similar: 00665271-v
similar: 02526663-v

00665271-v
type: LexicalConcept
in scheme: en-word.net
definition: verify by consulting a source or authority
example: check the spelling of this word
example: check your facts
ili: i25041
lexfile: verb.cognition
part of speech: verb
hypernym: 00666401-v
similar: 00664507-v

determine-v
type: LexicalEntry
canonical form: determine
sense: 00922307-v
part of speech: verb

find out-v
type: LexicalEntry
canonical form: find out
sense: 00922307-v
part of speech: verb

watch-v
type: LexicalEntry
canonical form: watch
sense: 00922307-v
part of speech: verb

learn-v
type: LexicalEntry
canonical form: learn
sense: 00922307-v
part of speech: verb

00922307-v
type: LexicalConcept
in scheme: en-word.net
definition: find out, learn, or determine with certainty, usually by making an inquiry or other effort
example: I want to see whether she speaks French
example: See whether it works
example: find out if he speaks Russian
example: Check whether the train leaves on time
ili: i26213
lexfile: verb.communication
part of speech: verb
hypernym: 02372362-v
similar: 00664507-v
similar: 00920843-v

01067021-v
type: LexicalConcept
in scheme: en-word.net
definition: write out a check on a bank account
ili: i26912
lexfile: verb.communication
part of speech: verb
hypernym: 01066821-v

01117182-v
type: LexicalConcept
in scheme: en-word.net
definition: place into check
example: He checked my kings
ili: i27171
lexfile: verb.competition
part of speech: verb
domain topic: 00504248-n
entails: 01079008-v
hypernym: 01120867-v

turn back-v
type: LexicalEntry
canonical form: turn back
sense: 01133899-v
part of speech: verb

arrest-v
type: LexicalEntry
canonical form: arrest
sense: 01133899-v
part of speech: verb

stop-v
type: LexicalEntry
canonical form: stop
sense: 01133899-v
part of speech: verb

contain-v
type: LexicalEntry
canonical form: contain
sense: 01133899-v
part of speech: verb
sense: 02516039-v

hold back-v
type: LexicalEntry
canonical form: hold back
sense: 01133899-v
part of speech: verb

01133899-v
type: LexicalConcept
in scheme: en-word.net
definition: hold back, as of a danger or an enemy; check the expansion or influence of
example: Arrest the downward trend
example: Check the growth of communism in South East Asia
example: Contain the rebel movement
example: Turn back the tide of communism
ili: i27259
lexfile: verb.competition
part of speech: verb
hypernym: 01130221-v

01142182-v
type: LexicalConcept
in scheme: en-word.net
definition: decline to initiate betting
ili: i27310
lexfile: verb.competition
part of speech: verb
domain topic: 00489236-n
hypernym: 01079008-v

bridle-n
type: LexicalEntry
canonical form: bridle
sense: 01148552-n
part of speech: noun

curb-n
type: LexicalEntry
canonical form: curb
sense: 01148552-n
part of speech: noun

01148552-n
type: LexicalConcept
in scheme: en-word.net
definition: the act of restraining power or action or limiting excess
example: his common sense is a bridle to his quick temper
ili: i41407
lexfile: noun.act
part of speech: noun
hypernym: 01147872-n

checker-v
type: LexicalEntry
canonical form: checker
sense: 01696873-v
part of speech: verb

chequer-v
type: LexicalEntry
canonical form: chequer
sense: 01696873-v
part of speech: verb

01696873-v
type: LexicalConcept
in scheme: en-word.net
definition: mark into squares or draw squares on; draw crossed lines on
ili: i30209
lexfile: verb.creation
part of speech: verb
hypernym: 01694189-v

01865389-v
type: LexicalConcept
in scheme: en-word.net
definition: stop for a moment, as if out of uncertainty or caution
example: She checked for an instant and missed a step
ili: i31008
lexfile: verb.motion
part of speech: verb
hypernym: 01864781-v
similar: 01865608-v
similar: 01865753-v

01865608-v
type: LexicalConcept
in scheme: en-word.net
definition: stop in a chase especially when scent is lost
example: The dog checked
ili: i31009
lexfile: verb.motion
part of speech: verb
hypernym: 01864781-v
similar: 01865389-v

01865753-v
type: LexicalConcept
in scheme: en-word.net
definition: abandon the intended prey, turn, and pursue an inferior prey
ili: i31010
lexfile: verb.motion
part of speech: verb
domain topic: 05643293-n
hypernym: 01864781-v
similar: 01865389-v

02352443-v
type: LexicalConcept
in scheme: en-word.net
definition: hand over something to somebody as for temporary safekeeping
example: Check your coat at the door
ili: i33475
lexfile: verb.possession
part of speech: verb
hypernym: 02352633-v
similar: 02352901-v

02352901-v
type: LexicalConcept
in scheme: en-word.net
definition: consign for shipment on a vehicle
example: check your luggage before boarding
ili: i33477
lexfile: verb.possession
part of speech: verb
hypernym: 02352633-v
similar: 02352443-v

hold in-v
type: LexicalEntry
canonical form: hold in
sense: 02516039-v
part of speech: verb

hold-v
type: LexicalEntry
canonical form: hold
sense: 02516039-v
part of speech: verb

curb-v
type: LexicalEntry
canonical form: curb
sense: 02516039-v
part of speech: verb

moderate-v
type: LexicalEntry
canonical form: moderate
sense: 02516039-v
part of speech: verb

02516039-v
type: LexicalConcept
in scheme: en-word.net
definition: lessen the intensity of; temper; hold in restraint; hold or keep within limits
example: moderate your alcohol intake
example: hold your tongue
example: hold your temper
example: control your anger
ili: i34266
lexfile: verb.social
part of speech: verb
hypernym: 00233707-v

02538948-v
type: LexicalConcept
in scheme: en-word.net
definition: make an examination or investigation
example: check into the rumor
example: check the time of the class
ili: i34367
lexfile: verb.social
part of speech: verb
hypernym: 02135744-v

discipline-v
type: LexicalEntry
canonical form: discipline
sense: 02559394-v
part of speech: verb

train-v
type: LexicalEntry
canonical form: train
sense: 02559394-v
part of speech: verb

condition-v
type: LexicalEntry
canonical form: condition
sense: 02559394-v
part of speech: verb

02559394-v
type: LexicalConcept
in scheme: en-word.net
definition: develop (a child's or animal's) behavior by instruction and practice; especially to teach self-control
example: Parents must discipline their children
example: Is this dog trained?
ili: i34462
lexfile: verb.social
part of speech: verb
hypernym: 00254647-v
similar: 02392176-v

02563464-v
type: LexicalConcept
in scheme: en-word.net
definition: block or impede (a player from the opposing team) in ice hockey
ili: i34478
lexfile: verb.social
part of speech: verb
hypernym: 02563025-v

match-v
type: LexicalEntry
canonical form: match
sense: 02663315-v
part of speech: verb

fit-v
type: LexicalEntry
canonical form: fit
sense: 02663315-v
part of speech: verb

correspond-v
type: LexicalEntry
canonical form: correspond
sense: 02663315-v
part of speech: verb

jibe-v
type: LexicalEntry
canonical form: jibe
sense: 02663315-v
part of speech: verb

gibe-v
type: LexicalEntry
canonical form: gibe
sense: 02663315-v
part of speech: verb

tally-v
type: LexicalEntry
canonical form: tally
sense: 02663315-v
part of speech: verb

agree-v
type: LexicalEntry
canonical form: agree
sense: 02663315-v
part of speech: verb

02663315-v
type: LexicalConcept
in scheme: en-word.net
definition: be compatible, similar or consistent; coincide in their characteristics
example: The two stories don't agree in many details
example: The handwriting checks with the signature on the form
example: The suspect's fingerprints don't match those on the gun
ili: i34952
lexfile: verb.stative
part of speech: verb
hypernym: 02622439-v
similar: 02705946-v
similar: 02664361-v

02664361-v
type: LexicalConcept
in scheme: en-word.net
definition: be verified or confirmed; pass inspection
example: These stories don't check!
ili: i34954
lexfile: verb.stative
part of speech: verb
hypernym: 02530710-v
similar: 02663315-v

03014816-n
type: LexicalConcept
in scheme: en-word.net
definition: a textile pattern of squares or crossed lines (resembling a checkerboard)
example: she wore a skirt with checks
ili: i51805
lexfile: noun.artifact
part of speech: noun
hypernym: 04575584-n

chip-n
type: LexicalEntry
canonical form: chip
sense: 04700256-n
part of speech: noun

04700256-n
type: LexicalConcept
in scheme: en-word.net
definition: a mark left after a small piece has been chopped or broken off of something
ili: i61714
lexfile: noun.attribute
part of speech: noun
hypernym: 04699505-n

hindrance-n
type: LexicalEntry
canonical form: hindrance
sense: 05697054-n
part of speech: noun

hinderance-n
type: LexicalEntry
canonical form: hinderance
sense: 05697054-n
part of speech: noun

deterrent-n
type: LexicalEntry
canonical form: deterrent
sense: 05697054-n
part of speech: noun

impediment-n
type: LexicalEntry
canonical form: impediment
sense: 05697054-n
part of speech: noun

balk-n
type: LexicalEntry
canonical form: balk
sense: 05697054-n
part of speech: noun

baulk-n
type: LexicalEntry
canonical form: baulk
sense: 05697054-n
part of speech: noun

handicap-n
type: LexicalEntry
canonical form: handicap
sense: 05697054-n
part of speech: noun

05697054-n
type: LexicalConcept
in scheme: en-word.net
definition: something immaterial that interferes with or delays action or progress
ili: i66814
lexfile: noun.cognition
part of speech: noun
hypernym: 04716529-n

assay-n
type: LexicalEntry
canonical form: assay
sense: 05746570-n
part of speech: noun

05746570-n
type: LexicalConcept
in scheme: en-word.net
definition: an appraisal of the state of affairs
example: they made an assay of the contents
example: a check on its dependability under stress
ili: i67062
lexfile: noun.cognition
part of speech: noun
hypernym: 05741528-n

confirmation-n
type: LexicalEntry
canonical form: confirmation
sense: 05833569-n
part of speech: noun

verification-n
type: LexicalEntry
canonical form: verification
sense: 05833569-n
part of speech: noun

substantiation-n
type: LexicalEntry
canonical form: substantiation
sense: 05833569-n
part of speech: noun

05833569-n
type: LexicalConcept
in scheme: en-word.net
definition: additional proof that something that was believed (some fact or hypothesis or theory) is correct
example: fossils provided further confirmation of the evolutionary theory
ili: i67491
lexfile: noun.cognition
part of speech: noun
hypernym: 05833063-n

chit-n
type: LexicalEntry
canonical form: chit
sense: 06529933-n
part of speech: noun

tab-n
type: LexicalEntry
canonical form: tab
sense: 06529933-n
part of speech: noun

06529933-n
type: LexicalConcept
in scheme: en-word.net
definition: the bill in a restaurant
example: he asked the waiter for the check
ili: i70717
lexfile: noun.communication
part of speech: noun
hypernym: 06528946-n

check mark-n
type: LexicalEntry
canonical form: check mark
sense: 06831605-n
part of speech: noun

tick-n
type: LexicalEntry
canonical form: tick
sense: 06831605-n
part of speech: noun

06831605-n
type: LexicalConcept
in scheme: en-word.net
definition: a mark indicating that something has been noted or completed etc.
example: as he called the roll he put a check mark by each student's name
ili: i72327
lexfile: noun.communication
part of speech: noun
hypernym: 06830640-n

bank check-n
type: LexicalEntry
canonical form: bank check
sense: 13402907-n
part of speech: noun

cheque-n
type: LexicalEntry
canonical form: cheque
sense: 13402907-n
part of speech: noun

13402907-n
type: LexicalConcept
in scheme: en-word.net
definition: a written order directing a bank to pay money
example: he paid all his bills by check
ili: i107042
lexfile: noun.possession
part of speech: noun
hypernym: 13398441-n

arrest-n
type: LexicalEntry
canonical form: arrest
sense: 14034398-n
part of speech: noun

halt-n
type: LexicalEntry
canonical form: halt
sense: 14034398-n
part of speech: noun

hitch-n
type: LexicalEntry
canonical form: hitch
sense: 14034398-n
part of speech: noun

stay-n
type: LexicalEntry
canonical form: stay
sense: 14034398-n
part of speech: noun

stop-n
type: LexicalEntry
canonical form: stop
sense: 14034398-n
part of speech: noun

stoppage-n
type: LexicalEntry
canonical form: stoppage
sense: 14034398-n
part of speech: noun

14034398-n
type: LexicalConcept
in scheme: en-word.net
definition: the state of inactivity following an interruption
example: the negotiations were in arrest
example: held them in check
example: during the halt he got some lunch
example: the momentary stay enabled him to escape the blow
example: he spent the entire stop in his seat
ili: i110559
lexfile: noun.state
part of speech: noun
hypernym: 14033619-n