drive around-v
type: LexicalEntry
canonical form: drive around
sense: 02061973-v
part of speech: verb

chauffeur-v
type: LexicalEntry
canonical form: chauffeur
sense: 02061973-v
part of speech: verb

02061973-v
type: LexicalConcept
in scheme: en-word.net
definition: drive someone in a vehicle
ili: i32036
lexfile: verb.motion
part of speech: verb
hypernym: 02060895-v

chauffeur-n
type: LexicalEntry
canonical form: chauffeur
sense: 09928311-n
part of speech: noun

09928311-n
type: LexicalConcept
in scheme: en-word.net
definition: a person paid to drive a privately owned car
ili: i88917
lexfile: noun.person
part of speech: noun
hypernym: 10054631-n