charge-v
type: LexicalEntry
canonical form: charge
sense: 00499097-v
part of speech: verb
sense: 00518927-v
sense: 00519195-v
sense: 00702283-v
sense: 00729953-v
sense: 00752178-v
sense: 00752351-v
sense: 00752538-v
sense: 00845147-v
sense: 00845638-v
sense: 00871595-v
sense: 01124145-v
sense: 01154680-v
sense: 01491585-v
sense: 01492993-v
sense: 01689855-v
sense: 01766380-v
sense: 01989438-v
sense: 02059191-v
sense: 02322269-v
sense: 02325354-v
sense: 02326026-v
sense: 02352633-v
sense: 02353564-v
sense: 02481345-v

00499097-v
type: LexicalConcept
in scheme: en-word.net
definition: saturate
example: The room was charged with tension and anxiety
ili: i24199
lexfile: verb.change
part of speech: verb
hypernym: 00498786-v
similar: 01491585-v

00518927-v
type: LexicalConcept
in scheme: en-word.net
definition: energize a battery by passing a current through it in the direction opposite to discharge
example: I need to charge my car battery
ili: i24305
lexfile: verb.change
part of speech: verb
hypernym: 02332196-v
similar: 00519195-v

00519195-v
type: LexicalConcept
in scheme: en-word.net
definition: cause formation of a net electrical charge in or on
example: charge a conductor
ili: i24306
lexfile: verb.change
part of speech: verb
hypernym: 00126072-v
similar: 00518927-v

00702283-v
type: LexicalConcept
in scheme: en-word.net
definition: set or ask for a certain price
example: How much do you charge for lunch?
example: This fellow charges $100 for a massage
ili: i25209
lexfile: verb.cognition
part of speech: verb
hypernym: 00701581-v

blame-v
type: LexicalEntry
canonical form: blame
sense: 00729953-v
part of speech: verb

00729953-v
type: LexicalConcept
in scheme: en-word.net
definition: attribute responsibility to
example: We blamed the accident on her
example: The tragedy was charged to her inexperience
ili: i25339
lexfile: verb.cognition
part of speech: verb
hypernym: 00728262-v

mission-n
type: LexicalEntry
canonical form: mission
sense: 00732520-n
part of speech: noun

charge-n
type: LexicalEntry
canonical form: charge
sense: 00732520-n
part of speech: noun
sense: 00831039-n
sense: 00976848-n
sense: 03011879-n
sense: 03012169-n
sense: 06573933-n
sense: 06743529-n
sense: 07184131-n
sense: 07205601-n
sense: 07543858-n
sense: 09208509-n
sense: 09929218-n
sense: 11455142-n
sense: 13327892-n
sense: 13421971-n

commission-n
type: LexicalEntry
canonical form: commission
sense: 00732520-n
part of speech: noun
sense: 07184131-n

00732520-n
type: LexicalConcept
in scheme: en-word.net
definition: a special assignment that is given to a person or group
example: a confidential mission to London
example: his charge was to deliver a message
ili: i39275
lexfile: noun.act
part of speech: noun
hypernym: 00731545-n

00752178-v
type: LexicalConcept
in scheme: en-word.net
definition: instruct or command with authority
example: The teacher charged the children to memorize the poem
ili: i25449
lexfile: verb.communication
part of speech: verb
hypernym: 00751969-v

00752351-v
type: LexicalConcept
in scheme: en-word.net
definition: instruct (a jury) about the law, its application, and the weighing of evidence
ili: i25450
lexfile: verb.communication
part of speech: verb
domain topic: 08458195-n
hypernym: 00751969-v

saddle-v
type: LexicalEntry
canonical form: saddle
sense: 00752538-v
part of speech: verb

burden-v
type: LexicalEntry
canonical form: burden
sense: 00752538-v
part of speech: verb

00752538-v
type: LexicalConcept
in scheme: en-word.net
definition: impose a task upon, assign a responsibility to
example: He charged her with cleaning up all the files over the weekend
ili: i25451
lexfile: verb.communication
part of speech: verb
hypernym: 00753573-v

care-n
type: LexicalEntry
canonical form: care
sense: 00831039-n
part of speech: noun

tutelage-n
type: LexicalEntry
canonical form: tutelage
sense: 00831039-n
part of speech: noun

guardianship-n
type: LexicalEntry
canonical form: guardianship
sense: 00831039-n
part of speech: noun

00831039-n
type: LexicalConcept
in scheme: en-word.net
definition: attention and management implying responsibility for safety
example: he is in the care of a bodyguard
ili: i39765
lexfile: noun.act
part of speech: noun
hypernym: 00819341-n

accuse-v
type: LexicalEntry
canonical form: accuse
sense: 00845147-v
part of speech: verb

00845147-v
type: LexicalConcept
in scheme: en-word.net
definition: blame for, make a claim of wrongdoing or misbehavior against
example: he charged the director with indifference
ili: i25858
lexfile: verb.communication
part of speech: verb
hypernym: 00729953-v

00845638-v
type: LexicalConcept
in scheme: en-word.net
definition: make an accusatory claim
example: The defense attorney charged that the jurors were biased
ili: i25860
lexfile: verb.communication
part of speech: verb
hypernym: 00758383-v

lodge-v
type: LexicalEntry
canonical form: lodge
sense: 00871595-v
part of speech: verb

file-v
type: LexicalEntry
canonical form: file
sense: 00871595-v
part of speech: verb

00871595-v
type: LexicalConcept
in scheme: en-word.net
definition: file a formal charge against
example: The suspect was charged with murdering his wife
ili: i25976
lexfile: verb.communication
part of speech: verb
hypernym: 00844668-v

00976848-n
type: LexicalConcept
in scheme: en-word.net
definition: an impetuous rush toward someone or something
example: the wrestler's charge carried him past his adversary
example: the battle began with a cavalry charge
ili: i40503
lexfile: noun.act
part of speech: noun
hypernym: 00974725-n

bear down-v
type: LexicalEntry
canonical form: bear down
sense: 01124145-v
part of speech: verb

01124145-v
type: LexicalConcept
in scheme: en-word.net
definition: to make a rush at or sudden attack upon, as in battle
example: he saw Jess charging at him with a pitchfork
ili: i27206
lexfile: verb.competition
part of speech: verb
hypernym: 01122368-v

level-v
type: LexicalEntry
canonical form: level
sense: 01154680-v
part of speech: verb

point-v
type: LexicalEntry
canonical form: point
sense: 01154680-v
part of speech: verb

01154680-v
type: LexicalConcept
in scheme: en-word.net
definition: direct into a position for use
example: point a gun
example: He charged his weapon at me
ili: i27384
lexfile: verb.competition
part of speech: verb
hypernym: 01153576-v
similar: 01155136-v

01491585-v
type: LexicalConcept
in scheme: en-word.net
definition: fill or load to capacity
example: charge the wagon with hay
ili: i29167
lexfile: verb.contact
part of speech: verb
hypernym: 00126072-v
similar: 00499097-v

load-v
type: LexicalEntry
canonical form: load
sense: 01492993-v
part of speech: verb

01492993-v
type: LexicalConcept
in scheme: en-word.net
definition: provide (a device) with something necessary
example: He loaded his gun carefully
example: load the camera
ili: i29174
lexfile: verb.contact
part of speech: verb
hypernym: 00453467-v

01689855-v
type: LexicalConcept
in scheme: en-word.net
definition: place a heraldic bearing on
example: charge all weapons, shields, and banners
ili: i30176
lexfile: verb.creation
part of speech: verb
domain topic: 00935235-n
hypernym: 01688794-v

agitate-v
type: LexicalEntry
canonical form: agitate
sense: 01766380-v
part of speech: verb

rouse-v
type: LexicalEntry
canonical form: rouse
sense: 01766380-v
part of speech: verb

turn on-v
type: LexicalEntry
canonical form: turn on
sense: 01766380-v
part of speech: verb

commove-v
type: LexicalEntry
canonical form: commove
sense: 01766380-v
part of speech: verb

excite-v
type: LexicalEntry
canonical form: excite
sense: 01766380-v
part of speech: verb

charge up-v
type: LexicalEntry
canonical form: charge up
sense: 01766380-v
part of speech: verb

01766380-v
type: LexicalConcept
in scheme: en-word.net
definition: cause to be agitated, excited, or roused
example: The speaker charged up the crowd with his inflammatory remarks
ili: i30555
lexfile: verb.emotion
part of speech: verb
domain topic: 00845915-n
hypernym: 01774422-v

01989438-v
type: LexicalConcept
in scheme: en-word.net
definition: lie down on command, of hunting dogs
ili: i31663
lexfile: verb.motion
part of speech: verb
hypernym: 01989043-v

tear-v-1
type: LexicalEntry
canonical form: tear
sense: 02059191-v
part of speech: verb

shoot-v
type: LexicalEntry
canonical form: shoot
sense: 02059191-v
part of speech: verb

shoot down-v
type: LexicalEntry
canonical form: shoot down
sense: 02059191-v
part of speech: verb

buck-v
type: LexicalEntry
canonical form: buck
sense: 02059191-v
part of speech: verb

02059191-v
type: LexicalConcept
in scheme: en-word.net
definition: move quickly and violently
example: The car tore down the street
example: He came charging into my office
ili: i32022
lexfile: verb.motion
part of speech: verb
hypernym: 02062918-v
similar: 02065423-v

02322269-v
type: LexicalConcept
in scheme: en-word.net
definition: pay with a credit card; pay with plastic money; postpone payment by recording a purchase as a debt
example: Will you pay cash or charge the purchase?
ili: i33321
lexfile: verb.possession
part of speech: verb
hypernym: 02256551-v

bill-v
type: LexicalEntry
canonical form: bill
sense: 02325354-v
part of speech: verb

02325354-v
type: LexicalConcept
in scheme: en-word.net
definition: demand payment
example: Will I get charged for this service?
example: We were billed for 4 nights in the hotel, although we stayed only 3 nights
ili: i33338
lexfile: verb.possession
part of speech: verb
hypernym: 02270039-v
similar: 02326026-v

02326026-v
type: LexicalConcept
in scheme: en-word.net
definition: enter a certain amount as a charge
example: he charged me $15
ili: i33341
lexfile: verb.possession
part of speech: verb
hypernym: 02270368-v
similar: 02325354-v

consign-v
type: LexicalEntry
canonical form: consign
sense: 02352633-v
part of speech: verb

02352633-v
type: LexicalConcept
in scheme: en-word.net
definition: give over to another for care or safekeeping
example: consign your baggage
ili: i33476
lexfile: verb.possession
part of speech: verb
hypernym: 02354208-v

commit-v
type: LexicalEntry
canonical form: commit
sense: 02353564-v
part of speech: verb

institutionalize-v
type: LexicalEntry
canonical form: institutionalize
sense: 02353564-v
part of speech: verb

institutionalise-v
type: LexicalEntry
canonical form: institutionalise
sense: 02353564-v
part of speech: verb

send-v
type: LexicalEntry
canonical form: send
sense: 02353564-v
part of speech: verb

02353564-v
type: LexicalConcept
in scheme: en-word.net
definition: cause to be admitted; of persons to an institution
example: After the second episode, she had to be committed
example: he was committed to prison
ili: i33482
lexfile: verb.possession
part of speech: verb
hypernym: 02236972-v

appoint-v
type: LexicalEntry
canonical form: appoint
sense: 02481345-v
part of speech: verb

02481345-v
type: LexicalConcept
in scheme: en-word.net
definition: assign a duty, responsibility or obligation to
example: He was appointed deputy manager
example: She was charged with supervising the creation of a concordance
ili: i34100
lexfile: verb.social
part of speech: verb
hypernym: 02372362-v

burster-n
type: LexicalEntry
canonical form: burster
sense: 03011879-n
part of speech: noun

bursting charge-n
type: LexicalEntry
canonical form: bursting charge
sense: 03011879-n
part of speech: noun

explosive charge-n
type: LexicalEntry
canonical form: explosive charge
sense: 03011879-n
part of speech: noun

03011879-n
type: LexicalConcept
in scheme: en-word.net
definition: a quantity of explosive to be set off at one time
example: this cartridge has a powder charge of 50 grains
ili: i51787
lexfile: noun.artifact
part of speech: noun
hypernym: 03309675-n

bearing-n
type: LexicalEntry
canonical form: bearing
sense: 03012169-n
part of speech: noun

heraldic bearing-n
type: LexicalEntry
canonical form: heraldic bearing
sense: 03012169-n
part of speech: noun

armorial bearing-n
type: LexicalEntry
canonical form: armorial bearing
sense: 03012169-n
part of speech: noun

03012169-n
type: LexicalConcept
in scheme: en-word.net
definition: heraldry consisting of a design or image depicted on a shield
ili: i51788
lexfile: noun.artifact
part of speech: noun
hypernym: 03520482-n

complaint-n
type: LexicalEntry
canonical form: complaint
sense: 06573933-n
part of speech: noun

06573933-n
type: LexicalConcept
in scheme: en-word.net
definition: (criminal law) a pleading describing some wrong or offense
example: he was arrested on a charge of larceny
ili: i70941
lexfile: noun.communication
part of speech: noun
domain topic: 06551169-n
hypernym: 06571356-n

accusation-n
type: LexicalEntry
canonical form: accusation
sense: 06743529-n
part of speech: noun

06743529-n
type: LexicalConcept
in scheme: en-word.net
definition: an assertion that someone is guilty of a fault or offence
example: the newspaper published charges that Jones was guilty of drunken driving
ili: i71869
lexfile: noun.communication
part of speech: noun
hypernym: 06742248-n

direction-n
type: LexicalEntry
canonical form: direction
sense: 07184131-n
part of speech: noun

07184131-n
type: LexicalConcept
in scheme: en-word.net
definition: a formal statement of a command or injunction to do something
example: the judge's charge to the jury
ili: i74329
lexfile: noun.communication
part of speech: noun
hypernym: 07182782-n

billing-n
type: LexicalEntry
canonical form: billing
sense: 07205601-n
part of speech: noun

07205601-n
type: LexicalConcept
in scheme: en-word.net
definition: request for payment of a debt
example: they submitted their charges at the end of each month
ili: i74445
lexfile: noun.communication
part of speech: noun
hypernym: 07199985-n

bang-n
type: LexicalEntry
canonical form: bang
sense: 07543858-n
part of speech: noun

boot-n
type: LexicalEntry
canonical form: boot
sense: 07543858-n
part of speech: noun

rush-n
type: LexicalEntry
canonical form: rush
sense: 07543858-n
part of speech: noun

flush-n
type: LexicalEntry
canonical form: flush
sense: 07543858-n
part of speech: noun

thrill-n
type: LexicalEntry
canonical form: thrill
sense: 07543858-n
part of speech: noun

kick-n
type: LexicalEntry
canonical form: kick
sense: 07543858-n
part of speech: noun

07543858-n
type: LexicalConcept
in scheme: en-word.net
definition: the swift release of a store of affective force
example: they got a great bang out of it
example: what a boot!
example: he got a quick rush from injecting heroin
example: he does it for kicks
ili: i76315
lexfile: noun.feeling
part of speech: noun
hypernym: 07543600-n

cathexis-n
type: LexicalEntry
canonical form: cathexis
sense: 09208509-n
part of speech: noun

09208509-n
type: LexicalConcept
in scheme: en-word.net
definition: (psychoanalysis) the libidinal energy invested in some idea or person or object
example: Freud thought of cathexis as a psychic analog of an electrical charge
ili: i84916
lexfile: noun.motive
part of speech: noun
domain topic: 00705558-n
hypernym: 09208337-n

09929218-n
type: LexicalConcept
in scheme: en-word.net
definition: a person committed to your care
example: the teacher led her charges across the street
ili: i88923
lexfile: noun.person
part of speech: noun
hypernym: 10024466-n

electric charge-n
type: LexicalEntry
canonical form: electric charge
sense: 11455142-n
part of speech: noun

11455142-n
type: LexicalConcept
in scheme: en-word.net
definition: the quantity of unbalanced electricity in a body (either positive or negative) and construed as an excess or deficiency of electrons
example: the battery needed a fresh charge
ili: i97678
lexfile: noun.phenomenon
part of speech: noun
hypernym: 11469339-n

13327892-n
type: LexicalConcept
in scheme: en-word.net
definition: the price charged for some article or service
example: the admission charge
ili: i106612
lexfile: noun.possession
part of speech: noun
hypernym: 13296870-n

13421971-n
type: LexicalConcept
in scheme: en-word.net
definition: financial liabilities (such as a tax)
example: the charges against the estate
ili: i107160
lexfile: noun.possession
part of speech: noun
domain topic: 13330021-n
hypernym: 13417227-n