charcoal-a
type: LexicalEntry
canonical form: charcoal
sense: 00389786-s
part of speech: adjective

charcoal-grey-a
type: LexicalEntry
canonical form: charcoal-grey
sense: 00389786-s
part of speech: adjective

charcoal-gray-a
type: LexicalEntry
canonical form: charcoal-gray
sense: 00389786-s
part of speech: adjective

00389786-s
type: LexicalConcept
in scheme: en-word.net
definition: of a very dark grey
ili: i2187
lexfile: adj.all
part of speech: adjective satellite
similar: https://en-word.net/synset/00387453-a

charcoal-v
type: LexicalEntry
canonical form: charcoal
sense: 01697033-v
part of speech: verb

01697033-v
type: LexicalConcept
in scheme: en-word.net
definition: draw, trace, or represent with charcoal
ili: i30210
lexfile: verb.creation
part of speech: verb
domain topic: 00935235-n
entails: 01585566-v
hypernym: 01694189-v

charcoal-n
type: LexicalEntry
canonical form: charcoal
sense: 03011428-n
part of speech: noun
sense: 03011559-n
sense: 04969417-n
sense: 14709457-n

fusain-n
type: LexicalEntry
canonical form: fusain
sense: 03011428-n
part of speech: noun

03011428-n
type: LexicalConcept
in scheme: en-word.net
definition: a stick of black carbon material used for drawing
ili: i51783
lexfile: noun.artifact
part of speech: noun
hypernym: 04615925-n

03011559-n
type: LexicalConcept
in scheme: en-word.net
definition: a drawing made with a stick of black carbon material
ili: i51784
lexfile: noun.artifact
part of speech: noun
hypernym: 03239009-n

charcoal grey-n
type: LexicalEntry
canonical form: charcoal grey
sense: 04969417-n
part of speech: noun

charcoal gray-n
type: LexicalEntry
canonical form: charcoal gray
sense: 04969417-n
part of speech: noun

oxford grey-n
type: LexicalEntry
canonical form: oxford grey
sense: 04969417-n
part of speech: noun

oxford gray-n
type: LexicalEntry
canonical form: oxford gray
sense: 04969417-n
part of speech: noun

04969417-n
type: LexicalConcept
in scheme: en-word.net
definition: a very dark grey color
ili: i63050
lexfile: noun.attribute
part of speech: noun
hypernym: 04968868-n

wood coal-n
type: LexicalEntry
canonical form: wood coal
sense: 14709457-n
part of speech: noun

14709457-n
type: LexicalConcept
in scheme: en-word.net
definition: a carbonaceous material obtained by heating wood or other organic matter in the absence of air
ili: i114153
lexfile: noun.substance
part of speech: noun
hypernym: 14899228-n
hypernym: 14657384-n