cetacean-a
type: LexicalEntry
canonical form: cetacean
sense: https://en-word.net/lemma/cetacean-a#02700710-a
part of speech: adjective

cetaceous-a
type: LexicalEntry
canonical form: cetaceous
sense: https://en-word.net/lemma/cetaceous-a#02700710-a
part of speech: adjective

https://en-word.net/synset/02700710-a
type: LexicalConcept
in scheme: en-word.net
definition: of or relating to whales and dolphins etc
ili: i15073
lexfile: adj.pert
part of speech: adjective