center-a
type: LexicalEntry
canonical form: center
sense: 00331404-s
part of speech: adjective
sense: https://en-word.net/lemma/center-a#02039031-a

halfway-a
type: LexicalEntry
canonical form: halfway
sense: 00331404-s
part of speech: adjective

middle-a
type: LexicalEntry
canonical form: middle
sense: 00331404-s
part of speech: adjective

midway-a
type: LexicalEntry
canonical form: midway
sense: 00331404-s
part of speech: adjective

centre-s
type: LexicalEntry
canonical form: centre
sense: 00331404-s
part of speech: adjective satellite

00331404-s
type: LexicalConcept
in scheme: en-word.net
definition: equally distant from the extremes
ili: i1836
lexfile: adj.all
part of speech: adjective satellite
similar: https://en-word.net/synset/00330729-a

concentrate-v
type: LexicalEntry
canonical form: concentrate
sense: 00724156-v
part of speech: verb

focus-v
type: LexicalEntry
canonical form: focus
sense: 00724156-v
part of speech: verb

center-v
type: LexicalEntry
canonical form: center
sense: 00724156-v
part of speech: verb
sense: 01856668-v
sense: 02682306-v

centre-v
type: LexicalEntry
canonical form: centre
sense: 00724156-v
part of speech: verb
sense: 01856668-v
sense: 02682306-v

pore-v
type: LexicalEntry
canonical form: pore
sense: 00724156-v
part of speech: verb

rivet-v
type: LexicalEntry
canonical form: rivet
sense: 00724156-v
part of speech: verb

00724156-v
type: LexicalConcept
in scheme: en-word.net
definition: direct one's attention on something
example: Please focus on your studies and not on your hobbies
ili: i25312
lexfile: verb.cognition
part of speech: verb
hypernym: 00630153-v
similar: 00724637-v

center-n
type: LexicalEntry
canonical form: center
sense: 00726757-n
part of speech: noun
sense: 00728798-n
sense: 00729762-n
sense: 02997001-n
sense: 02997788-n
sense: 03971750-n
sense: 05471109-n
sense: 05820064-n
sense: 05929717-n
sense: 07618221-n
sense: 08433480-n
sense: 08498843-n
sense: 08531106-n
sense: 08538999-n
sense: 08540894-n
sense: 09923774-n
sense: 09924009-n
sense: 09924161-n

centre-n
type: LexicalEntry
canonical form: centre
sense: 00726757-n
part of speech: noun
sense: 00728798-n
sense: 00729762-n
sense: 02997001-n
sense: 02997788-n
sense: 03971750-n
sense: 05471109-n
sense: 05820064-n
sense: 05929717-n
sense: 07618221-n
sense: 08433480-n
sense: 08498843-n
sense: 08531106-n
sense: 08538999-n
sense: 08540894-n
sense: 09923774-n
sense: 09924009-n
sense: 09924161-n

00726757-n
type: LexicalConcept
in scheme: en-word.net
definition: a position on a basketball team of the player who participates in the jump that starts the game
ili: i39242
lexfile: noun.act
part of speech: noun
hypernym: 00723730-n

00728798-n
type: LexicalConcept
in scheme: en-word.net
definition: (American football) the position of the player on the line of scrimmage who puts the ball in play
example: it is a center's responsibility to get the football to the quarterback
ili: i39252
lexfile: noun.act
part of speech: noun
hypernym: 00727351-n

00729762-n
type: LexicalConcept
in scheme: en-word.net
definition: the position on a hockey team of the player who participates in the face off at the beginning of the game
ili: i39258
lexfile: noun.act
part of speech: noun
hypernym: 00723730-n

01856668-v
type: LexicalConcept
in scheme: en-word.net
definition: move into the center
example: That vase in the picture is not centered
ili: i30963
lexfile: verb.motion
part of speech: verb
hypernym: 01854282-v

centre-a
type: LexicalEntry
canonical form: centre
sense: https://en-word.net/lemma/centre-a#02039031-a
part of speech: adjective

https://en-word.net/synset/02039031-a
type: LexicalConcept
in scheme: en-word.net
definition: of or belonging to neither the right nor the left politically or intellectually
ili: i11134
lexfile: adj.all
part of speech: adjective
similar: 02039217-s

focus on-v
type: LexicalEntry
canonical form: focus on
sense: 02682306-v
part of speech: verb

center on-v
type: LexicalEntry
canonical form: center on
sense: 02682306-v
part of speech: verb

revolve around-v
type: LexicalEntry
canonical form: revolve around
sense: 02682306-v
part of speech: verb

revolve about-v
type: LexicalEntry
canonical form: revolve about
sense: 02682306-v
part of speech: verb

concentrate on-v
type: LexicalEntry
canonical form: concentrate on
sense: 02682306-v
part of speech: verb

02682306-v
type: LexicalConcept
in scheme: en-word.net
definition: center upon
example: Her entire attention centered on her children
example: Our day revolved around our work
ili: i35044
lexfile: verb.stative
part of speech: verb
hypernym: 02681865-v

02997001-n
type: LexicalConcept
in scheme: en-word.net
definition: a building dedicated to a particular activity
example: they were raising money to build a new center for research
ili: i51701
lexfile: noun.artifact
part of speech: noun
hypernym: 02916498-n

center field-n
type: LexicalEntry
canonical form: center field
sense: 02997788-n
part of speech: noun

centerfield-n
type: LexicalEntry
canonical form: centerfield
sense: 02997788-n
part of speech: noun

02997788-n
type: LexicalConcept
in scheme: en-word.net
definition: the piece of ground in the outfield directly ahead of the catcher
example: he hit the ball to deep center
ili: i51704
lexfile: noun.artifact
part of speech: noun
hypernym: 08691133-n

plaza-n
type: LexicalEntry
canonical form: plaza
sense: 03971750-n
part of speech: noun

mall-n
type: LexicalEntry
canonical form: mall
sense: 03971750-n
part of speech: noun

shopping mall-n
type: LexicalEntry
canonical form: shopping mall
sense: 03971750-n
part of speech: noun

shopping center-n
type: LexicalEntry
canonical form: shopping center
sense: 03971750-n
part of speech: noun

shopping centre-n
type: LexicalEntry
canonical form: shopping centre
sense: 03971750-n
part of speech: noun

03971750-n
type: LexicalConcept
in scheme: en-word.net
definition:
  value: mercantile establishment consisting of a carefully landscaped complex of shops representing leading merchandisers; usually includes restaurants and a convenient parking area; a modern version of the traditional marketplace
example: a good plaza should have a movie house
example: they spent their weekends at the local malls
ili: i57445
lexfile: noun.artifact
part of speech: noun
hypernym: 03753653-n
mero part: 03382851-n

nerve center-n
type: LexicalEntry
canonical form: nerve center
sense: 05471109-n
part of speech: noun

nerve centre-n
type: LexicalEntry
canonical form: nerve centre
sense: 05471109-n
part of speech: noun

05471109-n
type: LexicalConcept
in scheme: en-word.net
definition: a cluster of nerve cells governing a specific bodily process
example: in most people the speech center is in the left hemisphere
ili: i65665
lexfile: noun.body
part of speech: noun
hypernym: 05470250-n

center of attention-n
type: LexicalEntry
canonical form: center of attention
sense: 05820064-n
part of speech: noun

centre of attention-n
type: LexicalEntry
canonical form: centre of attention
sense: 05820064-n
part of speech: noun

05820064-n
type: LexicalConcept
in scheme: en-word.net
definition: the object upon which interest and attention focuses
example: his stories made him the center of the party
ili: i67423
lexfile: noun.cognition
part of speech: noun
hypernym: 05818974-n

kernel-n
type: LexicalEntry
canonical form: kernel
sense: 05929717-n
part of speech: noun

substance-n
type: LexicalEntry
canonical form: substance
sense: 05929717-n
part of speech: noun

core-n
type: LexicalEntry
canonical form: core
sense: 05929717-n
part of speech: noun

essence-n
type: LexicalEntry
canonical form: essence
sense: 05929717-n
part of speech: noun

gist-n
type: LexicalEntry
canonical form: gist
sense: 05929717-n
part of speech: noun

heart-n
type: LexicalEntry
canonical form: heart
sense: 05929717-n
part of speech: noun
sense: 08540894-n

heart and soul-n
type: LexicalEntry
canonical form: heart and soul
sense: 05929717-n
part of speech: noun

inwardness-n
type: LexicalEntry
canonical form: inwardness
sense: 05929717-n
part of speech: noun

marrow-n
type: LexicalEntry
canonical form: marrow
sense: 05929717-n
part of speech: noun

meat-n
type: LexicalEntry
canonical form: meat
sense: 05929717-n
part of speech: noun

nub-n
type: LexicalEntry
canonical form: nub
sense: 05929717-n
part of speech: noun

pith-n
type: LexicalEntry
canonical form: pith
sense: 05929717-n
part of speech: noun

sum-n
type: LexicalEntry
canonical form: sum
sense: 05929717-n
part of speech: noun

nitty-gritty-n
type: LexicalEntry
canonical form: nitty-gritty
sense: 05929717-n
part of speech: noun

05929717-n
type: LexicalConcept
in scheme: en-word.net
definition: the choicest or most essential or most vital part of some idea or experience
example: the gist of the prosecutor's argument
example: the heart and soul of the Republican Party
example: the nub of the story
ili: i67950
lexfile: noun.cognition
part of speech: noun
hypernym: 05817200-n

07618221-n
type: LexicalConcept
in scheme: en-word.net
definition: the sweet central portion of a piece of candy that is enclosed in chocolate or some other covering
ili: i76754
lexfile: noun.food
part of speech: noun
hypernym: 07612255-n

08433480-n
type: LexicalConcept
in scheme: en-word.net
definition: politically moderate persons; centrists
ili: i81341
lexfile: noun.group
part of speech: noun
hypernym: 07990472-n
mero member: 09924290-n

08498843-n
type: LexicalConcept
in scheme: en-word.net
definition: the middle of a military or naval formation
example: they had to reinforce the center
ili: i81624
lexfile: noun.group
part of speech: noun
domain topic: 08215965-n
hypernym: 08443418-n

08531106-n
type: LexicalConcept
in scheme: en-word.net
definition: a place where some particular activity is concentrated
example: they received messages from several centers
ili: i81788
lexfile: noun.location
part of speech: noun
hypernym: 08530790-n

midpoint-n
type: LexicalEntry
canonical form: midpoint
sense: 08538999-n
part of speech: noun

08538999-n
type: LexicalConcept
in scheme: en-word.net
definition: a point equidistant from the ends of a line or the extremities of a figure
ili: i81833
lexfile: noun.location
part of speech: noun
hypernym: 08637636-n

middle-n
type: LexicalEntry
canonical form: middle
sense: 08540894-n
part of speech: noun

eye-n
type: LexicalEntry
canonical form: eye
sense: 08540894-n
part of speech: noun

08540894-n
type: LexicalConcept
in scheme: en-word.net
definition: an area that is approximately central within some larger region
example: it is in the center of town
example: they ran forward into the heart of the struggle
example: they were in the eye of the storm
ili: i81841
lexfile: noun.location
part of speech: noun
hypernym: 08514304-n

snapper-n
type: LexicalEntry
canonical form: snapper
sense: 09923774-n
part of speech: noun

09923774-n
type: LexicalConcept
in scheme: en-word.net
definition: (football) the person who plays center on the line of scrimmage and snaps the ball to the quarterback
example: the center fumbled the handoff
ili: i88888
lexfile: noun.person
part of speech: noun
domain topic: 00469555-n
hypernym: 10283108-n

09924009-n
type: LexicalConcept
in scheme: en-word.net
definition: (basketball) the person who plays center on a basketball team
ili: i88889
lexfile: noun.person
part of speech: noun
domain topic: 00482004-n
hypernym: 09861435-n

09924161-n
type: LexicalConcept
in scheme: en-word.net
definition: (ice hockey) the person who plays center on a hockey team
ili: i88890
lexfile: noun.person
part of speech: noun
domain topic: 00464604-n
hypernym: 10198922-n