cementum-n
type: LexicalEntry
canonical form: cementum
sense: 05316335-n
part of speech: noun

cement-n
type: LexicalEntry
canonical form: cement
sense: 05316335-n
part of speech: noun

05316335-n
type: LexicalConcept
in scheme: en-word.net
definition: a specialized bony substance covering the root of a tooth
ili: i64856
lexfile: noun.body
part of speech: noun
hypernym: 05271580-n