caulk-n
type: LexicalEntry
canonical form: caulk
sense: 15039263-n
part of speech: noun

caulking-n
type: LexicalEntry
canonical form: caulking
sense: 15039263-n
part of speech: noun

15039263-n
type: LexicalConcept
in scheme: en-word.net
definition: a waterproof filler and sealant that is used in building and repair to make watertight
ili: i116055
lexfile: noun.substance
part of speech: noun
hypernym: 14729879-n