catalogue-v
type: LexicalEntry
canonical form: catalogue
sense: 00654293-v
part of speech: verb
sense: 01629881-v

catalog-v
type: LexicalEntry
canonical form: catalog
sense: 00654293-v
part of speech: verb
sense: 01629881-v

00654293-v
type: LexicalConcept
in scheme: en-word.net
definition: make an itemized list or catalog of; classify
example: He is cataloguing his photographic negatives
ili: i24994
lexfile: verb.cognition
part of speech: verb
hypernym: 00656296-v

01629881-v
type: LexicalConcept
in scheme: en-word.net
definition: make a catalogue, compile a catalogue
example: She spends her weekends cataloguing
ili: i29892
lexfile: verb.creation
part of speech: verb
hypernym: 01629175-v

catalog-n
type: LexicalEntry
canonical form: catalog
sense: 06427849-n
part of speech: noun
sense: 06499734-n

catalogue-n
type: LexicalEntry
canonical form: catalogue
sense: 06427849-n
part of speech: noun
sense: 06499734-n

06427849-n
type: LexicalConcept
in scheme: en-word.net
definition: a book or pamphlet containing an enumeration of things
example: he found it in the Sears catalog
ili: i70211
lexfile: noun.communication
part of speech: noun
hypernym: 06422547-n

06499734-n
type: LexicalConcept
in scheme: en-word.net
definition: a complete list of things; usually arranged systematically
example: it does not pretend to be a catalog of his achievements
ili: i70544
lexfile: noun.communication
part of speech: noun
hypernym: 06492991-n