Columbus-n
type: LexicalEntry
canonical form: Columbus
sense: 09153681-n
part of speech: noun

capital of Ohio-n
type: LexicalEntry
canonical form: capital of Ohio
sense: 09153681-n
part of speech: noun

09153681-n
type: LexicalConcept
in scheme: en-word.net
definition: the state capital of Ohio; located in the center of the state; site of Ohio State University
ili: i84618
lexfile: noun.location
part of speech: noun
instance hypernym: 08713353-n
mero part: 03848388-n