Lansing-n
type: LexicalEntry
canonical form: Lansing
sense: 09123918-n
part of speech: noun

capital of Michigan-n
type: LexicalEntry
canonical form: capital of Michigan
sense: 09123918-n
part of speech: noun

09123918-n
type: LexicalConcept
in scheme: en-word.net
definition: capital of the state of Michigan; located in southern Michigan on the Grand River
ili: i84458
lexfile: noun.location
part of speech: noun
instance hypernym: 08713353-n