Buenos Aires-n
type: LexicalEntry
canonical form: Buenos Aires
sense: 08730709-n
part of speech: noun

capital of Argentina-n
type: LexicalEntry
canonical form: capital of Argentina
sense: 08730709-n
part of speech: noun

08730709-n
type: LexicalConcept
in scheme: en-word.net
definition: capital and largest city of Argentina; located in eastern Argentina near Uruguay; Argentina's chief port and industrial and cultural center
ili: i82688
lexfile: noun.location
part of speech: noun
instance hypernym: 08709407-n
instance hypernym: 08651532-n