cot-n
type: LexicalEntry
canonical form: cot
sense: 03119155-n
part of speech: noun

camp bed-n
type: LexicalEntry
canonical form: camp bed
sense: 03119155-n
part of speech: noun

03119155-n
type: LexicalConcept
in scheme: en-word.net
definition: a small bed that folds up for storage or transport
ili: i52401
lexfile: noun.artifact
part of speech: noun
hypernym: 02821967-n
mero part: 03660152-n