call option-n
type: LexicalEntry
canonical form: call option
sense: 00081563-n
part of speech: noun

call-n
type: LexicalEntry
canonical form: call
sense: 00081563-n
part of speech: noun
sense: 00165622-n
sense: 01057417-n
sense: 01057878-n
sense: 06208240-n
sense: 06283456-n
sense: 06594937-n
sense: 06809500-n
sense: 07135232-n
sense: 07205353-n
sense: 07206789-n
sense: 07207171-n
sense: 07207321-n

00081563-n
type: LexicalConcept
in scheme: en-word.net
definition: the option to buy a given stock (or stock index or commodity future) at a given price before a given date
ili: i35832
lexfile: noun.act
part of speech: noun
hypernym: 13262498-n

call-v
type: LexicalEntry
canonical form: call
sense: 00107035-v
part of speech: verb
sense: 00693282-v
sense: 00740588-v
sense: 00740752-v
sense: 00755926-v
sense: 00756201-v
sense: 00785570-v
sense: 00791110-v
sense: 00794133-v
sense: 00824407-v
sense: 00871057-v
sense: 00875684-v
sense: 00915018-v
sense: 00919743-v
sense: 00973047-v
sense: 00977068-v
sense: 01030757-v
sense: 01064761-v
sense: 01070017-v
sense: 01070815-v
sense: 01903010-v
sense: 02305021-v
sense: 02364060-v
sense: 02434657-v
sense: 02493222-v
sense: 02493550-v
sense: 02607453-v
sense: 02649505-v

00107035-v
type: LexicalConcept
in scheme: en-word.net
definition: rouse somebody from sleep with a call
example: I was called at 5 A.M. this morning
ili: i22310
lexfile: verb.body
part of speech: verb
hypernym: 00018806-v

00165622-n
type: LexicalConcept
in scheme: en-word.net
definition: (sports) the decision made by an umpire or referee
example: he was ejected for protesting the call
ili: i36275
lexfile: noun.act
part of speech: noun
domain topic: 00524569-n
hypernym: 00163453-n

00693282-v
type: LexicalConcept
in scheme: en-word.net
definition: consider or regard as being
example: I would not call her beautiful
ili: i25167
lexfile: verb.cognition
part of speech: verb
hypernym: 00692380-v
similar: 00973047-v

00740588-v
type: LexicalConcept
in scheme: en-word.net
definition: challenge the sincerity or truthfulness of
example: call the speaker on a question of fact
ili: i25393
lexfile: verb.cognition
part of speech: verb
hypernym: 00870790-v
similar: 00871057-v

00740752-v
type: LexicalConcept
in scheme: en-word.net
definition: utter in a loud voice or announce
example: He called my name
example: The auctioneer called the bids
ili: i25394
lexfile: verb.cognition
part of speech: verb
hypernym: 00985856-v
similar: 00915018-v

00755926-v
type: LexicalConcept
in scheme: en-word.net
definition: order, summon, or request for a specific duty or activity, work, role
example: He was already called 4 times for jury duty
example: They called him to active military duty
ili: i25466
lexfile: verb.communication
part of speech: verb
hypernym: 00755473-v
similar: 00794133-v

00756201-v
type: LexicalConcept
in scheme: en-word.net
definition: order or request or give a command for
example: The unions called a general strike for Sunday
ili: i25467
lexfile: verb.communication
part of speech: verb
hypernym: 00747485-v

00785570-v
type: LexicalConcept
in scheme: en-word.net
definition: lure by imitating the characteristic call of an animal
example: Call ducks
ili: i25601
lexfile: verb.communication
part of speech: verb
hypernym: 00784574-v
similar: 00977068-v

telephone-v
type: LexicalEntry
canonical form: telephone
sense: 00791110-v
part of speech: verb

call up-v
type: LexicalEntry
canonical form: call up
sense: 00791110-v
part of speech: verb

phone-v
type: LexicalEntry
canonical form: phone
sense: 00791110-v
part of speech: verb

ring-v
type: LexicalEntry
canonical form: ring
sense: 00791110-v
part of speech: verb

00791110-v
type: LexicalConcept
in scheme: en-word.net
definition: get or try to get into communication (with someone) by telephone
example: I tried to call you all night
example: Take two aspirin and call me in the morning
ili: i25628
lexfile: verb.communication
part of speech: verb
domain topic: 06282943-n
entails: 00791970-v
hypernym: 00792365-v
similar: 01064761-v

send for-v
type: LexicalEntry
canonical form: send for
sense: 00794133-v
part of speech: verb

00794133-v
type: LexicalConcept
in scheme: en-word.net
definition: order, request, or command to come
example: She was called into the director's office
example: Call the police!
ili: i25642
lexfile: verb.communication
part of speech: verb
hypernym: 00748704-v
similar: 02434657-v
similar: 00755926-v

00824407-v
type: LexicalConcept
in scheme: en-word.net
definition: declare in the capacity of an umpire or referee
example: call a runner out
ili: i25772
lexfile: verb.communication
part of speech: verb
hypernym: 00824028-v
similar: 01070815-v

00871057-v
type: LexicalConcept
in scheme: en-word.net
definition: challenge (somebody) to make good on a statement; charge with or censure for an offense
example: He deserves to be called on that
ili: i25974
lexfile: verb.communication
part of speech: verb
hypernym: 00870790-v
similar: 00740588-v

00875684-v
type: LexicalConcept
in scheme: en-word.net
definition: present for redemption before maturation
example: Call a bond
ili: i25990
lexfile: verb.communication
part of speech: verb
hypernym: 00757790-v
similar: 02364060-v

shout-v
type: LexicalEntry
canonical form: shout
sense: 00915018-v
part of speech: verb

shout out-v
type: LexicalEntry
canonical form: shout out
sense: 00915018-v
part of speech: verb

cry-v
type: LexicalEntry
canonical form: cry
sense: 00915018-v
part of speech: verb

yell-v
type: LexicalEntry
canonical form: yell
sense: 00915018-v
part of speech: verb

scream-v
type: LexicalEntry
canonical form: scream
sense: 00915018-v
part of speech: verb

holler-v
type: LexicalEntry
canonical form: holler
sense: 00915018-v
part of speech: verb

hollo-v
type: LexicalEntry
canonical form: hollo
sense: 00915018-v
part of speech: verb

squall-v
type: LexicalEntry
canonical form: squall
sense: 00915018-v
part of speech: verb

00915018-v
type: LexicalConcept
in scheme: en-word.net
definition: utter a sudden loud cry
example: she cried with pain when the doctor inserted the needle
example: I yelled to her from the window but she couldn't hear me
ili: i26178
lexfile: verb.communication
part of speech: verb
hypernym: 00985856-v
similar: 00740752-v
similar: 00914001-v

predict-v
type: LexicalEntry
canonical form: predict
sense: 00919743-v
part of speech: verb

foretell-v
type: LexicalEntry
canonical form: foretell
sense: 00919743-v
part of speech: verb

prognosticate-v
type: LexicalEntry
canonical form: prognosticate
sense: 00919743-v
part of speech: verb

forebode-v
type: LexicalEntry
canonical form: forebode
sense: 00919743-v
part of speech: verb

anticipate-v
type: LexicalEntry
canonical form: anticipate
sense: 00919743-v
part of speech: verb

promise-v
type: LexicalEntry
canonical form: promise
sense: 00919743-v
part of speech: verb

00919743-v
type: LexicalConcept
in scheme: en-word.net
definition: make a prediction about; tell in advance
example: Call the outcome of an election
ili: i26202
lexfile: verb.communication
part of speech: verb
hypernym: 00918880-v

00973047-v
type: LexicalConcept
in scheme: en-word.net
definition: ascribe a quality to or give a name of a common noun that reflects a quality
example: He called me a bastard
example: She called her children lazy and ungrateful
ili: i26448
lexfile: verb.communication
part of speech: verb
hypernym: 01031885-v
similar: 00693282-v
similar: 01030757-v
similar: 01070017-v

00977068-v
type: LexicalConcept
in scheme: en-word.net
definition: utter a characteristic note or cry
example: bluejays called to one another
ili: i26465
lexfile: verb.communication
part of speech: verb
hypernym: 00985856-v
similar: 00785570-v

name-v
type: LexicalEntry
canonical form: name
sense: 01030757-v
part of speech: verb

know as-v
type: LexicalEntry
canonical form: know as
sense: 01030757-v
part of speech: verb

be known as-v
type: LexicalEntry
canonical form: be known as
sense: 01030757-v
part of speech: verb

01030757-v
type: LexicalConcept
in scheme: en-word.net
definition: assign a specified (usually proper) name to
example: They named their son David
example: The new school was named after the famous Civil Rights leader
ili: i26719
lexfile: verb.communication
part of speech: verb
hypernym: 01031885-v
similar: 00973047-v
similar: 02607453-v

01057417-n
type: LexicalConcept
in scheme: en-word.net
definition: a visit in an official or professional capacity
example: the pastor's calls on his parishioners
example: the salesman's call on a customer
ili: i40940
lexfile: noun.act
part of speech: noun
hypernym: 01235249-n

01057878-n
type: LexicalConcept
in scheme: en-word.net
definition: a brief social visit
example: senior professors' wives no longer make afternoon calls on newcomers
example: the characters in Henry James' novels are forever paying calls on each other, usually in the parlor of some residence
ili: i40942
lexfile: noun.act
part of speech: noun
hypernym: 01235721-n

01064761-v
type: LexicalConcept
in scheme: en-word.net
definition: send a message or attempt to reach someone by radio, phone, etc.; make a signal to in order to transmit a message
example: Hawaii is calling!
example: A transmitter in Samoa was heard calling
ili: i26900
lexfile: verb.communication
part of speech: verb
domain topic: 06282431-n
hypernym: 00792365-v
similar: 00791110-v

01070017-v
type: LexicalConcept
in scheme: en-word.net
definition: read aloud to check for omissions or absentees
example: Call roll
ili: i26928
lexfile: verb.communication
part of speech: verb
hypernym: 00628065-v
similar: 00973047-v

01070815-v
type: LexicalConcept
in scheme: en-word.net
definition: indicate a decision in regard to
example: call balls and strikes behind the plate
ili: i26932
lexfile: verb.communication
part of speech: verb
domain topic: 00524569-n
hypernym: 00929986-v
similar: 00824407-v

call off-v
type: LexicalEntry
canonical form: call off
sense: 01903010-v
part of speech: verb

01903010-v
type: LexicalConcept
in scheme: en-word.net
definition: give the calls (to the dancers) for a square dance
ili: i31212
lexfile: verb.motion
part of speech: verb
entails: 01902886-v
hypernym: 02568816-v

bid-v
type: LexicalEntry
canonical form: bid
sense: 02305021-v
part of speech: verb

02305021-v
type: LexicalConcept
in scheme: en-word.net
definition: make a demand, as for a card or a suit or a show of hands
example: He called his trump
ili: i33231
lexfile: verb.possession
part of speech: verb
domain topic: 00489236-n
hypernym: 01075360-v

call in-v
type: LexicalEntry
canonical form: call in
sense: 02364060-v
part of speech: verb
sense: 02493222-v

02364060-v
type: LexicalConcept
in scheme: en-word.net
definition: demand payment of (a loan)
example: Call a loan
ili: i33546
lexfile: verb.possession
part of speech: verb
hypernym: 01019835-v
similar: 00875684-v

02434657-v
type: LexicalConcept
in scheme: en-word.net
definition: call a meeting; invite or command to meet
example: The Wannsee Conference was called to discuss the ‘Final Solution’
example: The new dean calls meetings every week
ili: i33879
lexfile: verb.social
part of speech: verb
causes: 02433771-v
hypernym: 00754770-v
similar: 00794133-v

visit-v
type: LexicalEntry
canonical form: visit
sense: 02493222-v
part of speech: verb

02493222-v
type: LexicalConcept
in scheme: en-word.net
definition: pay a brief visit
example: The mayor likes to call on some of the prominent citizens
ili: i34159
lexfile: verb.social
part of speech: verb
hypernym: 02492581-v
similar: 02493550-v

02493550-v
type: LexicalConcept
in scheme: en-word.net
definition: make a stop in a harbour
example: The ship will call in Honolulu tomorrow
ili: i34160
lexfile: verb.social
part of speech: verb
hypernym: 01866904-v
similar: 02493222-v

address-v
type: LexicalEntry
canonical form: address
sense: 02607453-v
part of speech: verb

02607453-v
type: LexicalConcept
in scheme: en-word.net
definition: greet, as with a prescribed form, title, or name
example: He always addresses me with ‘Sir’
example: Call me Mister
example: She calls him by first name
ili: i34696
lexfile: verb.social
part of speech: verb
hypernym: 00899077-v
similar: 01030757-v

02649505-v
type: LexicalConcept
in scheme: en-word.net
definition: stop or postpone because of adverse conditions, such as bad weather
example: call a football game
ili: i34884
lexfile: verb.stative
part of speech: verb
hypernym: 02648898-v

06208240-n
type: LexicalConcept
in scheme: en-word.net
definition: a special disposition (as if from a divine source) to pursue a particular course
example: he was disappointed that he had not heard the Call
ili: i69103
lexfile: noun.cognition
part of speech: noun
hypernym: 06206319-n

phone call-n
type: LexicalEntry
canonical form: phone call
sense: 06283456-n
part of speech: noun

telephone call-n
type: LexicalEntry
canonical form: telephone call
sense: 06283456-n
part of speech: noun

06283456-n
type: LexicalConcept
in scheme: en-word.net
definition: a method of contacting a person by phone
example: she reported several anonymous calls
example: he placed a phone call to London
example: he heard the phone ringing but didn't want to take the call
ili: i69471
lexfile: noun.communication
part of speech: noun
hypernym: 06282943-n

06594937-n
type: LexicalConcept
in scheme: en-word.net
definition: an instruction that interrupts the program being executed
example: Pascal performs calls by simply giving the name of the routine to be executed
ili: i71049
lexfile: noun.communication
part of speech: noun
hypernym: 06597067-n

birdcall-n
type: LexicalEntry
canonical form: birdcall
sense: 06809500-n
part of speech: noun

birdsong-n
type: LexicalEntry
canonical form: birdsong
sense: 06809500-n
part of speech: noun

song-n
type: LexicalEntry
canonical form: song
sense: 06809500-n
part of speech: noun

06809500-n
type: LexicalConcept
in scheme: en-word.net
definition: the characteristic sound produced by a bird
example: a bird will not learn its song unless it hears it at an early age
ili: i72202
lexfile: noun.communication
part of speech: noun
hypernym: 06809364-n

cry-n
type: LexicalEntry
canonical form: cry
sense: 07135232-n
part of speech: noun

outcry-n
type: LexicalEntry
canonical form: outcry
sense: 07135232-n
part of speech: noun

yell-n
type: LexicalEntry
canonical form: yell
sense: 07135232-n
part of speech: noun

shout-n
type: LexicalEntry
canonical form: shout
sense: 07135232-n
part of speech: noun

vociferation-n
type: LexicalEntry
canonical form: vociferation
sense: 07135232-n
part of speech: noun

07135232-n
type: LexicalConcept
in scheme: en-word.net
definition: a loud utterance; often in protest or opposition
example: the speaker was interrupted by loud cries from the rear of the audience
ili: i74082
lexfile: noun.communication
part of speech: noun
hypernym: 07124555-n

07205353-n
type: LexicalConcept
in scheme: en-word.net
definition: a request
example: many calls for Christmas stories
example: not many calls for buggywhips
ili: i74443
lexfile: noun.communication
part of speech: noun
hypernym: 07199985-n

claim-n
type: LexicalEntry
canonical form: claim
sense: 07206789-n
part of speech: noun

07206789-n
type: LexicalConcept
in scheme: en-word.net
definition: a demand
ili: i74452
lexfile: noun.communication
part of speech: noun
hypernym: 07205939-n

07207171-n
type: LexicalConcept
in scheme: en-word.net
definition: a demand for a show of hands in a card game
example: after two raises there was a call
ili: i74454
lexfile: noun.communication
part of speech: noun
hypernym: 07205939-n

margin call-n
type: LexicalEntry
canonical form: margin call
sense: 07207321-n
part of speech: noun

07207321-n
type: LexicalConcept
in scheme: en-word.net
definition: a demand by a broker that a customer deposit enough to bring their margin up to the minimum requirement
ili: i74455
lexfile: noun.communication
part of speech: noun
hypernym: 07205939-n