caddie-v
type: LexicalEntry
canonical form: caddie
sense: 01099271-v
part of speech: verb

caddy-v
type: LexicalEntry
canonical form: caddy
sense: 01099271-v
part of speech: verb

01099271-v
type: LexicalConcept
in scheme: en-word.net
definition: act as a caddie and carry clubs for a player
ili: i27076
lexfile: verb.competition
part of speech: verb
domain topic: 00465962-n
hypernym: 01097629-v

caddie-n
type: LexicalEntry
canonical form: caddie
sense: 09905855-n
part of speech: noun

golf caddie-n
type: LexicalEntry
canonical form: golf caddie
sense: 09905855-n
part of speech: noun

09905855-n
type: LexicalConcept
in scheme: en-word.net
definition: an attendant who carries the golf clubs for a player
ili: i88772
lexfile: noun.person
part of speech: noun
hypernym: 09841233-n