butter-v
type: LexicalEntry
canonical form: butter
sense: 01270562-v
part of speech: verb

01270562-v
type: LexicalConcept
in scheme: en-word.net
definition: spread butter on
example: butter bread
ili: i27992
lexfile: verb.contact
part of speech: verb
hypernym: 01335412-v

butter-n
type: LexicalEntry
canonical form: butter
sense: 07864314-n
part of speech: noun
sense: 09904267-n

07864314-n
type: LexicalConcept
in scheme: en-word.net
definition: an edible emulsion of fat globules made by churning milk or cream; for cooking and table use
ili: i78414
lexfile: noun.food
part of speech: noun
hypernym: 07859751-n
hypernym: 07571428-n

09904267-n
type: LexicalConcept
in scheme: en-word.net
definition: a fighter who strikes the opponent with their head
ili: i88760
lexfile: noun.person
part of speech: noun
hypernym: 09958771-n