burrow-v
type: LexicalEntry
canonical form: burrow
sense: 02045912-v
part of speech: verb

tunnel-v
type: LexicalEntry
canonical form: tunnel
sense: 02045912-v
part of speech: verb

02045912-v
type: LexicalConcept
in scheme: en-word.net
definition: move through by or as by digging
example: burrow through the forest
ili: i31954
lexfile: verb.motion
part of speech: verb
hypernym: 01312361-v

burrow-n
type: LexicalEntry
canonical form: burrow
sense: 09252948-n
part of speech: noun

tunnel-n
type: LexicalEntry
canonical form: tunnel
sense: 09252948-n
part of speech: noun

09252948-n
type: LexicalConcept
in scheme: en-word.net
definition: a hole made by an animal, usually for shelter
ili: i85131
lexfile: noun.object
part of speech: noun
hypernym: 09327656-n