bulb-n
type: LexicalEntry
canonical form: bulb
sense: 02918826-n
part of speech: noun
sense: 03671250-n
sense: 05234409-n
sense: 05502823-n
sense: 13154818-n
sense: 13886656-n

02918826-n
type: LexicalConcept
in scheme: en-word.net
definition: a rounded part of a cylindrical instrument (usually at one end)
example: the bulb of a syringe
ili: i51226
lexfile: noun.artifact
part of speech: noun
hypernym: 03898588-n

light bulb-n
type: LexicalEntry
canonical form: light bulb
sense: 03671250-n
part of speech: noun

lightbulb-n
type: LexicalEntry
canonical form: lightbulb
sense: 03671250-n
part of speech: noun

incandescent lamp-n
type: LexicalEntry
canonical form: incandescent lamp
sense: 03671250-n
part of speech: noun

electric light-n
type: LexicalEntry
canonical form: electric light
sense: 03671250-n
part of speech: noun

electric-light bulb-n
type: LexicalEntry
canonical form: electric-light bulb
sense: 03671250-n
part of speech: noun

03671250-n
type: LexicalConcept
in scheme: en-word.net
definition: electric lamp consisting of a transparent or translucent glass housing containing a wire filament (usually tungsten) that emits light when heated by electricity
ili: i55681
lexfile: noun.artifact
part of speech: noun
hypernym: 03277294-n
mero part: 03341520-n

05234409-n
type: LexicalConcept
in scheme: en-word.net
definition: a rounded dilation or expansion in a canal or vessel or organ
ili: i64421
lexfile: noun.body
part of speech: noun
hypernym: 05232895-n

medulla oblongata-n
type: LexicalEntry
canonical form: medulla oblongata
sense: 05502823-n
part of speech: noun

medulla-n
type: LexicalEntry
canonical form: medulla
sense: 05502823-n
part of speech: noun

05502823-n
type: LexicalConcept
in scheme: en-word.net
definition: lower or hindmost part of the brain; continuous with spinal cord; (‘bulb’ is an old term for medulla oblongata)
example: the medulla oblongata is the most vital part of the brain because it contains centers controlling breathing and heart functioning
ili: i65818
lexfile: noun.body
part of speech: noun
hypernym: 05470250-n
mero part: 05612947-n

13154818-n
type: LexicalConcept
in scheme: en-word.net
definition: a modified bud consisting of a thickened globular underground stem serving as a reproductive structure
ili: i105671
lexfile: noun.plant
part of speech: noun
hypernym: 13149924-n

13886656-n
type: LexicalConcept
in scheme: en-word.net
definition: anything with a round shape resembling a teardrop
ili: i109782
lexfile: noun.shape
part of speech: noun
hypernym: 13888104-n