piracy-n
type: LexicalEntry
canonical form: piracy
sense: 00785181-n
part of speech: noun

buccaneering-n
type: LexicalEntry
canonical form: buccaneering
sense: 00785181-n
part of speech: noun

00785181-n
type: LexicalConcept
in scheme: en-word.net
definition: hijacking on the high seas or in similar contexts; taking a ship or plane away from the control of those who are legally entitled to it
example: air piracy
ili: i39524
lexfile: noun.act
part of speech: noun
hypernym: 00784853-n