inspiration-n
type: LexicalEntry
canonical form: inspiration
sense: 03579155-n
part of speech: noun

brainchild-n
type: LexicalEntry
canonical form: brainchild
sense: 03579155-n
part of speech: noun

03579155-n
type: LexicalConcept
in scheme: en-word.net
definition: a product of your creative thinking and work
example: he had little respect for the inspirations of other artists
example: after years of work his brainchild was a tangible reality
ili: i55125
lexfile: noun.artifact
part of speech: noun
hypernym: 04014270-n