bracket-v
type: LexicalEntry
canonical form: bracket
sense: 00658587-v
part of speech: verb
sense: 00802248-v
sense: 01221355-v

00658587-v
type: LexicalConcept
in scheme: en-word.net
definition: classify or group
ili: i25011
lexfile: verb.cognition
part of speech: verb
hypernym: 00658247-v

bracket out-v
type: LexicalEntry
canonical form: bracket out
sense: 00802248-v
part of speech: verb

00802248-v
type: LexicalConcept
in scheme: en-word.net
definition: place into brackets
example: Please bracket this remark
ili: i25677
lexfile: verb.communication
part of speech: verb
hypernym: 00200761-v

01221355-v
type: LexicalConcept
in scheme: en-word.net
definition: support with brackets
example: bracket bookshelves
ili: i27715
lexfile: verb.contact
part of speech: verb
hypernym: 01219607-v

bracket-n
type: LexicalEntry
canonical form: bracket
sense: 02891810-n
part of speech: noun
sense: 06855340-n
sense: 06855502-n
sense: 08022536-n

wall bracket-n
type: LexicalEntry
canonical form: wall bracket
sense: 02891810-n
part of speech: noun

02891810-n
type: LexicalConcept
in scheme: en-word.net
definition: a support projecting from a wall (as to hold a shelf)
ili: i51065
lexfile: noun.artifact
part of speech: noun
hypernym: 04366676-n

square bracket-n
type: LexicalEntry
canonical form: square bracket
sense: 06855340-n
part of speech: noun

06855340-n
type: LexicalConcept
in scheme: en-word.net
definition: either of two punctuation marks (‘[’ or ‘]’) used to enclose textual material
ili: i72476
lexfile: noun.communication
part of speech: noun
hypernym: 06854415-n

angle bracket-n
type: LexicalEntry
canonical form: angle bracket
sense: 06855502-n
part of speech: noun

06855502-n
type: LexicalConcept
in scheme: en-word.net
definition: either of two punctuation marks (‘<’ or ‘>’) used in computer programming and sometimes used to enclose textual material
ili: i72477
lexfile: noun.communication
part of speech: noun
hypernym: 06854415-n

08022536-n
type: LexicalConcept
in scheme: en-word.net
definition: a category falling within certain defined limits
ili: i79368
lexfile: noun.group
part of speech: noun
hypernym: 08013131-n