bottleneck-v
type: LexicalEntry
canonical form: bottleneck
sense: 00305727-v
part of speech: verb
sense: 02563728-v

00305727-v
type: LexicalConcept
in scheme: en-word.net
definition: become narrow, like a bottleneck
example: Right by the bridge, the road bottlenecks
ili: i23250
lexfile: verb.change
part of speech: verb
hypernym: 00305890-v

02563728-v
type: LexicalConcept
in scheme: en-word.net
definition: slow down or impede by creating an obstruction
example: His laziness has bottlenecked our efforts to reform the system
ili: i34480
lexfile: verb.social
part of speech: verb
hypernym: 02563025-v

bottleneck-n
type: LexicalEntry
canonical form: bottleneck
sense: 02881107-n
part of speech: noun
sense: 13936007-n

02881107-n
type: LexicalConcept
in scheme: en-word.net
definition: the narrow part of a bottle near the top
ili: i51000
lexfile: noun.artifact
part of speech: noun
hypernym: 03898588-n

constriction-n
type: LexicalEntry
canonical form: constriction
sense: 13936007-n
part of speech: noun

chokepoint-n
type: LexicalEntry
canonical form: chokepoint
sense: 13936007-n
part of speech: noun

13936007-n
type: LexicalConcept
in scheme: en-word.net
definition: a narrowing that reduces the flow through a channel
ili: i110058
lexfile: noun.shape
part of speech: noun
hypernym: 05078196-n