freeze-v
type: LexicalEntry
canonical form: freeze
sense: 00270309-v
part of speech: verb

block-v
type: LexicalEntry
canonical form: block
sense: 00270309-v
part of speech: verb
sense: 00478313-v
sense: 00478459-v
sense: 00610654-v
sense: 01058906-v
sense: 01149526-v
sense: 01220488-v
sense: 01479113-v
sense: 01480632-v
sense: 01481963-v
sense: 01534280-v
sense: 02149973-v
sense: 02202937-v
sense: 02449162-v
sense: 02563025-v
sense: 02565578-v

immobilize-v
type: LexicalEntry
canonical form: immobilize
sense: 00270309-v
part of speech: verb

immobilise-v
type: LexicalEntry
canonical form: immobilise
sense: 00270309-v
part of speech: verb

00270309-v
type: LexicalConcept
in scheme: en-word.net
definition: prohibit the conversion or use of (assets)
example: Blocked funds
example: Freeze the assets of this hostile government
ili: i23066
lexfile: verb.change
part of speech: verb
hypernym: 02218472-v

00478313-v
type: LexicalConcept
in scheme: en-word.net
definition: shape into a block or blocks
example: block the graphs so one can see the results clearly
ili: i24099
lexfile: verb.change
part of speech: verb
hypernym: 00142011-v

00478459-v
type: LexicalConcept
in scheme: en-word.net
definition: shape by using a block
example: Block a hat
example: block a garment
ili: i24100
lexfile: verb.change
part of speech: verb
hypernym: 00142011-v

blocking-n
type: LexicalEntry
canonical form: blocking
sense: 00563435-n
part of speech: noun

block-n
type: LexicalEntry
canonical form: block
sense: 00563435-n
part of speech: noun
sense: 02759606-n
sense: 02855782-n
sense: 02856275-n
sense: 02856708-n
sense: 03293136-n
sense: 04026692-n
sense: 05653044-n
sense: 07970600-n
sense: 08659720-n
sense: 13647935-n
sense: 13937623-n

00563435-n
type: LexicalConcept
in scheme: en-word.net
definition: the act of obstructing or deflecting someone's movements
ili: i38347
lexfile: noun.act
part of speech: noun
hypernym: 00563317-n

forget-v
type: LexicalEntry
canonical form: forget
sense: 00610654-v
part of speech: verb

blank out-v
type: LexicalEntry
canonical form: blank out
sense: 00610654-v
part of speech: verb

draw a blank-v
type: LexicalEntry
canonical form: draw a blank
sense: 00610654-v
part of speech: verb

00610654-v
type: LexicalConcept
in scheme: en-word.net
definition: be unable to remember
example: I'm drawing a blank
example: You are blocking the name of your first wife!
ili: i24805
lexfile: verb.cognition
part of speech: verb
hypernym: 00630153-v

jam-v
type: LexicalEntry
canonical form: jam
sense: 01058906-v
part of speech: verb
sense: 01479113-v

01058906-v
type: LexicalConcept
in scheme: en-word.net
definition: interfere with or prevent the reception of signals
example: Jam the Voice of America
example: block the signals emitted by this station
ili: i26868
lexfile: verb.communication
part of speech: verb
hypernym: 00780320-v

parry-v
type: LexicalEntry
canonical form: parry
sense: 01149526-v
part of speech: verb

deflect-v
type: LexicalEntry
canonical form: deflect
sense: 01149526-v
part of speech: verb

01149526-v
type: LexicalConcept
in scheme: en-word.net
definition: impede the movement of (an opponent or a ball)
example: block an attack
ili: i27356
lexfile: verb.competition
part of speech: verb
hypernym: 01149384-v

01220488-v
type: LexicalConcept
in scheme: en-word.net
definition: support, secure, or raise with a block
example: block a plate for printing
example: block the wheels of a car
ili: i27710
lexfile: verb.contact
part of speech: verb
hypernym: 01219607-v

obstruct-v
type: LexicalEntry
canonical form: obstruct
sense: 01479113-v
part of speech: verb
sense: 02149973-v
sense: 02563025-v

obturate-v
type: LexicalEntry
canonical form: obturate
sense: 01479113-v
part of speech: verb

impede-v
type: LexicalEntry
canonical form: impede
sense: 01479113-v
part of speech: verb

occlude-v
type: LexicalEntry
canonical form: occlude
sense: 01479113-v
part of speech: verb

close up-v
type: LexicalEntry
canonical form: close up
sense: 01479113-v
part of speech: verb

01479113-v
type: LexicalConcept
in scheme: en-word.net
definition: block passage through
example: obstruct the path
ili: i29101
lexfile: verb.contact
part of speech: verb
hypernym: 02456614-v

barricade-v
type: LexicalEntry
canonical form: barricade
sense: 01480632-v
part of speech: verb

blockade-v
type: LexicalEntry
canonical form: blockade
sense: 01480632-v
part of speech: verb
sense: 02563025-v

stop-v
type: LexicalEntry
canonical form: stop
sense: 01480632-v
part of speech: verb
sense: 02565578-v

block off-v
type: LexicalEntry
canonical form: block off
sense: 01480632-v
part of speech: verb

block up-v
type: LexicalEntry
canonical form: block up
sense: 01480632-v
part of speech: verb

bar-v
type: LexicalEntry
canonical form: bar
sense: 01480632-v
part of speech: verb

01480632-v
type: LexicalConcept
in scheme: en-word.net
definition: render unsuitable for passage
example: block the way
example: barricade the streets
example: stop the busy road
ili: i29108
lexfile: verb.contact
part of speech: verb
hypernym: 01479113-v
similar: 02149973-v

stuff-v
type: LexicalEntry
canonical form: stuff
sense: 01481963-v
part of speech: verb

lug-v
type: LexicalEntry
canonical form: lug
sense: 01481963-v
part of speech: verb

choke up-v
type: LexicalEntry
canonical form: choke up
sense: 01481963-v
part of speech: verb

01481963-v
type: LexicalConcept
in scheme: en-word.net
definition: obstruct
example: My nose is all stuffed
example: Her arteries are blocked
ili: i29113
lexfile: verb.contact
part of speech: verb
hypernym: 01481233-v

01534280-v
type: LexicalConcept
in scheme: en-word.net
definition: stamp or emboss a title or design on a book with a block
example: block the book cover
ili: i29389
lexfile: verb.contact
part of speech: verb
hypernym: 01534053-v

02149973-v
type: LexicalConcept
in scheme: en-word.net
definition: shut out from view or get in the way so as to hide from sight
example: The thick curtain blocked the action on the stage
example: The trees obstruct my view of the mountains
ili: i32481
lexfile: verb.perception
part of speech: verb
hypernym: 02149298-v
similar: 01480632-v

02202937-v
type: LexicalConcept
in scheme: en-word.net
definition: interrupt the normal function of by means of anesthesia
example: block a nerve
example: block a muscle
ili: i32748
lexfile: verb.perception
part of speech: verb
hypernym: 00021058-v

02449162-v
type: LexicalConcept
in scheme: en-word.net
definition: run on a block system
example: block trains
ili: i33945
lexfile: verb.social
part of speech: verb
hypernym: 02448714-v

hinder-v
type: LexicalEntry
canonical form: hinder
sense: 02563025-v
part of speech: verb

stymie-v
type: LexicalEntry
canonical form: stymie
sense: 02563025-v
part of speech: verb

stymy-v
type: LexicalEntry
canonical form: stymy
sense: 02563025-v
part of speech: verb

embarrass-v
type: LexicalEntry
canonical form: embarrass
sense: 02563025-v
part of speech: verb

02563025-v
type: LexicalConcept
in scheme: en-word.net
definition: hinder or prevent the progress or accomplishment of
example: His brother blocked him at every turn
ili: i34477
lexfile: verb.social
part of speech: verb
hypernym: 02458316-v

halt-v
type: LexicalEntry
canonical form: halt
sense: 02565578-v
part of speech: verb

kibosh-v
type: LexicalEntry
canonical form: kibosh
sense: 02565578-v
part of speech: verb

02565578-v
type: LexicalConcept
in scheme: en-word.net
definition: stop from happening or developing
example: Block his election
example: Halt the process
ili: i34489
lexfile: verb.social
part of speech: verb
hypernym: 02458316-v

auction block-n
type: LexicalEntry
canonical form: auction block
sense: 02759606-n
part of speech: noun

02759606-n
type: LexicalConcept
in scheme: en-word.net
definition: a platform from which an auctioneer sells
example: they put their paintings on the block
ili: i50252
lexfile: noun.artifact
part of speech: noun
hypernym: 03968233-n

02855782-n
type: LexicalConcept
in scheme: en-word.net
definition: a solid piece of something (usually having flat rectangular sides)
example: the pyramids were built with large stone blocks
ili: i50851
lexfile: noun.artifact
part of speech: noun
hypernym: 00022119-n

02856275-n
type: LexicalConcept
in scheme: en-word.net
definition: housing in a large building that is divided into separate units
example: there is a block of classrooms in the west wing
ili: i50852
lexfile: noun.artifact
part of speech: noun
hypernym: 03551520-n

blockage-n
type: LexicalEntry
canonical form: blockage
sense: 02856708-n
part of speech: noun

closure-n
type: LexicalEntry
canonical form: closure
sense: 02856708-n
part of speech: noun

occlusion-n
type: LexicalEntry
canonical form: occlusion
sense: 02856708-n
part of speech: noun

stop-n
type: LexicalEntry
canonical form: stop
sense: 02856708-n
part of speech: noun

stoppage-n
type: LexicalEntry
canonical form: stoppage
sense: 02856708-n
part of speech: noun

02856708-n
type: LexicalConcept
in scheme: en-word.net
definition: an obstruction in a pipe or tube
example: we had to call a plumber to clear out the blockage in the drainpipe
ili: i50855
lexfile: noun.artifact
part of speech: noun
hypernym: 03845513-n

engine block-n
type: LexicalEntry
canonical form: engine block
sense: 03293136-n
part of speech: noun

cylinder block-n
type: LexicalEntry
canonical form: cylinder block
sense: 03293136-n
part of speech: noun

03293136-n
type: LexicalConcept
in scheme: en-word.net
definition: a metal casting containing the cylinders and cooling ducts of an engine
example: the engine had to be replaced because the block was cracked
ili: i53423
lexfile: noun.artifact
part of speech: noun
hypernym: 02983121-n
mero part: 03161071-n

pulley-n
type: LexicalEntry
canonical form: pulley
sense: 04026692-n
part of speech: noun

pulley-block-n
type: LexicalEntry
canonical form: pulley-block
sense: 04026692-n
part of speech: noun

pulley block-n
type: LexicalEntry
canonical form: pulley block
sense: 04026692-n
part of speech: noun

04026692-n
type: LexicalConcept
in scheme: en-word.net
definition: a simple machine consisting of a wheel with a groove in which a rope can run to change the direction or point of application of a force applied to the rope
ili: i57757
lexfile: noun.artifact
part of speech: noun
hypernym: 03706297-n

mental block-n
type: LexicalEntry
canonical form: mental block
sense: 05653044-n
part of speech: noun

05653044-n
type: LexicalConcept
in scheme: en-word.net
definition: an inability to remember or think of something you normally can do; often caused by emotional tension
example: I knew his name perfectly well but I had a temporary block
ili: i66585
lexfile: noun.cognition
part of speech: noun
hypernym: 05652767-n

07970600-n
type: LexicalConcept
in scheme: en-word.net
definition: a number or quantity of related things dealt with as a unit
example: he reserved a large block of seats
example: he held a large block of the company's stock
ili: i79109
lexfile: noun.group
part of speech: noun
hypernym: 07968050-n

city block-n
type: LexicalEntry
canonical form: city block
sense: 08659720-n
part of speech: noun

08659720-n
type: LexicalConcept
in scheme: en-word.net
definition: a rectangular area in a city surrounded by streets and usually containing several buildings
example: he lives in the next block
ili: i82373
lexfile: noun.location
part of speech: noun
hypernym: 08514304-n

13647935-n
type: LexicalConcept
in scheme: en-word.net
definition: (computer science) a sector or group of sectors that function as the smallest data unit permitted
example: since blocks are often defined as a single sector, the terms ‘block’ and ‘sector’ are sometimes used interchangeably
ili: i108300
lexfile: noun.quantity
part of speech: noun
domain topic: 06138021-n
hypernym: 13622839-n
mero part: 13647711-n

cube-n
type: LexicalEntry
canonical form: cube
sense: 13937623-n
part of speech: noun

13937623-n
type: LexicalConcept
in scheme: en-word.net
definition: a three-dimensional shape with six square or rectangular sides
ili: i110067
lexfile: noun.shape
part of speech: noun
hypernym: 13882990-n