blacktop-n
type: LexicalEntry
canonical form: blacktop
sense: 15001430-n
part of speech: noun

blacktopping-n
type: LexicalEntry
canonical form: blacktopping
sense: 15001430-n
part of speech: noun

15001430-n
type: LexicalConcept
in scheme: en-word.net
definition: a black bituminous material used for paving roads or other areas; usually spread over crushed rock
ili: i115845
lexfile: noun.substance
part of speech: noun
hypernym: 15002063-n