blackberry-v
type: LexicalEntry
canonical form: blackberry
sense: 01385743-v
part of speech: verb

01385743-v
type: LexicalConcept
in scheme: en-word.net
definition: pick or gather blackberries
example: The children went blackberrying
ili: i28624
lexfile: verb.contact
part of speech: verb
hypernym: 01386756-v

blackberry-n
type: LexicalEntry
canonical form: blackberry
sense: 07760787-n
part of speech: noun
sense: 12674523-n

07760787-n
type: LexicalConcept
in scheme: en-word.net
definition: large sweet black or very dark purple edible aggregate fruit of any of various bushes of the genus Rubus
ili: i77746
lexfile: noun.food
part of speech: noun
hypernym: 07758680-n
hypernym: 13159435-n

blackberry bush-n
type: LexicalEntry
canonical form: blackberry bush
sense: 12674523-n
part of speech: noun

12674523-n
type: LexicalConcept
in scheme: en-word.net
definition: bramble with sweet edible black or dark purple berries that usually do not separate from the receptacle
ili: i103368
lexfile: noun.plant
part of speech: noun
hypernym: 12673979-n