two-handed-a
type: LexicalEntry
canonical form: two-handed
sense: 02035424-s
part of speech: adjective

bimanual-a
type: LexicalEntry
canonical form: bimanual
sense: 02035424-s
part of speech: adjective

02035424-s
type: LexicalConcept
in scheme: en-word.net
definition: requiring two hands or designed for two people
example: a two-handed sledgehammer
example: a two-handed crosscut saw
example: a machine designed for bimanual operation
ili: i11111
lexfile: adj.all
part of speech: adjective satellite
similar: https://en-word.net/synset/02035082-a