berry-v
type: LexicalEntry
canonical form: berry
sense: 01386756-v
part of speech: verb

01386756-v
type: LexicalConcept
in scheme: en-word.net
definition: pick or gather berries
example: We went berrying in the summer
ili: i28631
lexfile: verb.contact
part of speech: verb
hypernym: 01384737-v

berry-n
type: LexicalEntry
canonical form: berry
sense: 07758680-n
part of speech: noun
sense: 13158186-n

07758680-n
type: LexicalConcept
in scheme: en-word.net
definition: any of numerous small and pulpy edible fruits; used as desserts or in making jams and jellies and preserves
ili: i77735
lexfile: noun.food
part of speech: noun
hypernym: 07721676-n

13158186-n
type: LexicalConcept
in scheme: en-word.net
definition: a small fruit having any of various structures, e.g., simple (grape or blueberry) or aggregate (blackberry or raspberry)
ili: i105685
lexfile: noun.plant
part of speech: noun
hypernym: 13155706-n
mero part: 07758680-n