bell-v
type: LexicalEntry
canonical form: bell
sense: 01299860-v
part of speech: verb

01299860-v
type: LexicalConcept
in scheme: en-word.net
definition: attach a bell to
example: bell cows
ili: i28159
lexfile: verb.contact
part of speech: verb
hypernym: 01299048-v

bell-n
type: LexicalEntry
canonical form: bell
sense: 02827590-n
part of speech: noun
sense: 02828000-n
sense: 03020822-n
sense: 03227219-n
sense: 07391844-n
sense: 13908953-n
sense: 15252389-n

02827590-n
type: LexicalConcept
in scheme: en-word.net
definition: a hollow device made of metal that makes a ringing sound when struck
ili: i50670
lexfile: noun.artifact
part of speech: noun
hypernym: 02679115-n
hypernym: 04224785-n
mero part: 03041213-n
mero part: 04268479-n

02828000-n
type: LexicalConcept
in scheme: en-word.net
definition: the flared opening of a tubular device
ili: i50671
lexfile: noun.artifact
part of speech: noun
hypernym: 03854249-n

chime-n
type: LexicalEntry
canonical form: chime
sense: 03020822-n
part of speech: noun

gong-n
type: LexicalEntry
canonical form: gong
sense: 03020822-n
part of speech: noun

03020822-n
type: LexicalConcept
in scheme: en-word.net
definition: a percussion instrument consisting of a set of tuned bells that are struck with a hammer; used as an orchestral instrument
ili: i51846
lexfile: noun.artifact
part of speech: noun
hypernym: 03921556-n

doorbell-n
type: LexicalEntry
canonical form: doorbell
sense: 03227219-n
part of speech: noun

buzzer-n
type: LexicalEntry
canonical form: buzzer
sense: 03227219-n
part of speech: noun

03227219-n
type: LexicalConcept
in scheme: en-word.net
definition: a push button at an outer door that gives a ringing or buzzing signal when pushed
ili: i53053
lexfile: noun.artifact
part of speech: noun
hypernym: 04033499-n

toll-n
type: LexicalEntry
canonical form: toll
sense: 07391844-n
part of speech: noun

07391844-n
type: LexicalConcept
in scheme: en-word.net
definition: the sound of a bell being struck
example: saved by the bell
example: she heard the distant toll of church bells
ili: i75459
lexfile: noun.event
part of speech: noun
hypernym: 07385893-n

bell shape-n
type: LexicalEntry
canonical form: bell shape
sense: 13908953-n
part of speech: noun

campana-n
type: LexicalEntry
canonical form: campana
sense: 13908953-n
part of speech: noun

13908953-n
type: LexicalConcept
in scheme: en-word.net
definition: the shape of a bell
ili: i109910
lexfile: noun.shape
part of speech: noun
hypernym: 13890262-n

ship's bell-n
type: LexicalEntry
canonical form: ship's bell
sense: 15252389-n
part of speech: noun

15252389-n
type: LexicalConcept
in scheme: en-word.net
definition: (nautical) each of the eight half-hour units of nautical time signaled by strokes of a ship's bell; eight bells signals 4:00, 8:00, or 12:00 o'clock, either a.m. or p.m.
ili: i117256
lexfile: noun.time
part of speech: noun
domain topic: 00315295-n
hypernym: 15179734-n