beer-n
type: LexicalEntry
canonical form: beer
sense: 07902824-n
part of speech: noun

07902824-n
type: LexicalConcept
in scheme: en-word.net
definition: a general name for alcoholic beverages made by fermenting a cereal (or mixture of cereals) flavored with hops
ili: i78683
lexfile: noun.food
part of speech: noun
hypernym: 07902547-n