bee-n
type: LexicalEntry
canonical form: bee
sense: 02209508-n
part of speech: noun
sense: 07992356-n

02209508-n
type: LexicalConcept
in scheme: en-word.net
definition: any of numerous hairy-bodied insects including social and solitary species
ili: i47086
lexfile: noun.animal
part of speech: noun
hypernym: 02208922-n

07992356-n
type: LexicalConcept
in scheme: en-word.net
definition: a social gathering to carry out some communal task or to hold competitions
ili: i79221
lexfile: noun.group
part of speech: noun
hypernym: 07461861-n