Atlanta-n
type: LexicalEntry
canonical form: Atlanta
sense: 01272126-n
part of speech: noun

battle of Atlanta-n
type: LexicalEntry
canonical form: battle of Atlanta
sense: 01272126-n
part of speech: noun

01272126-n
type: LexicalConcept
in scheme: en-word.net
definition: a siege in which Federal troops under Sherman cut off the railroads supplying the city and then burned it; 1864
ili: i42063
lexfile: noun.act
part of speech: noun
domain region: 09099186-n
instance hypernym: 01077041-n