barrio-n
type: LexicalEntry
canonical form: barrio
sense: 08693991-n
part of speech: noun
sense: 08694087-n

08693991-n
type: LexicalConcept
in scheme: en-word.net
definition: an urban area in a Spanish-speaking country
ili: i82531
lexfile: noun.location
part of speech: noun
hypernym: 08693705-n

08694087-n
type: LexicalConcept
in scheme: en-word.net
definition: a Spanish-speaking quarter in a town or city (especially in the United States)
ili: i82532
lexfile: noun.location
part of speech: noun
domain region: 09067337-n
hypernym: 08645494-n