barbeque-v
type: LexicalEntry
canonical form: barbeque
sense: 00325607-v
part of speech: verb

barbecue-v
type: LexicalEntry
canonical form: barbecue
sense: 00325607-v
part of speech: verb

cook out-v
type: LexicalEntry
canonical form: cook out
sense: 00325607-v
part of speech: verb

00325607-v
type: LexicalConcept
in scheme: en-word.net
definition: cook outdoors on a barbecue grill
example: let's barbecue that meat
example: We cooked out in the forest
ili: i23356
lexfile: verb.change
part of speech: verb
domain topic: 00244785-n
hypernym: 00327574-v

barbecue-n
type: LexicalEntry
canonical form: barbecue
sense: 02793692-n
part of speech: noun
sense: 07592346-n
sense: 07669757-n

barbeque-n
type: LexicalEntry
canonical form: barbeque
sense: 02793692-n
part of speech: noun
sense: 07592346-n
sense: 07669757-n

02793692-n
type: LexicalConcept
in scheme: en-word.net
definition: a rack to hold meat for cooking over hot charcoal usually out of doors
ili: i50455
lexfile: noun.artifact
part of speech: noun
hypernym: 04044916-n

07592346-n
type: LexicalConcept
in scheme: en-word.net
definition: a cookout in which food is cooked over an open fire; especially a whole animal carcass roasted on a spit
ili: i76577
lexfile: noun.food
part of speech: noun
hypernym: 07592142-n

07669757-n
type: LexicalConcept
in scheme: en-word.net
definition: meat that has been barbecued or grilled in a highly seasoned sauce
ili: i77127
lexfile: noun.food
part of speech: noun
hypernym: 07572999-n