vote-n
type: LexicalEntry
canonical form: vote
sense: 00184354-n
part of speech: noun

ballot-n
type: LexicalEntry
canonical form: ballot
sense: 00184354-n
part of speech: noun
sense: 06482593-n

voting-n
type: LexicalEntry
canonical form: voting
sense: 00184354-n
part of speech: noun

balloting-n
type: LexicalEntry
canonical form: balloting
sense: 00184354-n
part of speech: noun

00184354-n
type: LexicalConcept
in scheme: en-word.net
definition: a choice that is made by counting the number of people in favor of each alternative
example: there were only 17 votes in favor of the motion
example: they allowed just one vote per person
ili: i36377
lexfile: noun.act
part of speech: noun
hypernym: 00162063-n

ballot-v
type: LexicalEntry
canonical form: ballot
sense: 02468564-v
part of speech: verb

02468564-v
type: LexicalConcept
in scheme: en-word.net
definition: vote by ballot
example: The voters were balloting in this state
ili: i34034
lexfile: verb.social
part of speech: verb
hypernym: 02466737-v

06482593-n
type: LexicalConcept
in scheme: en-word.net
definition: a document listing the alternatives that is used in voting
ili: i70462
lexfile: noun.communication
part of speech: noun
hypernym: 06481744-n