bake-v
type: LexicalEntry
canonical form: bake
sense: 00320687-v
part of speech: verb
sense: 00545216-v
sense: 01667644-v
sense: 02761440-v

00320687-v
type: LexicalConcept
in scheme: en-word.net
definition: cook and make edible by putting in a hot oven
example: bake the potatoes
ili: i23329
lexfile: verb.change
part of speech: verb
domain topic: 00244785-n
hypernym: 00323648-v

broil-v
type: LexicalEntry
canonical form: broil
sense: 00545216-v
part of speech: verb
sense: 02761440-v

00545216-v
type: LexicalConcept
in scheme: en-word.net
definition: heat by a natural force
example: The sun broils the valley in the summer
ili: i24456
lexfile: verb.change
part of speech: verb
hypernym: 00371917-v

01667644-v
type: LexicalConcept
in scheme: en-word.net
definition: prepare with dry heat in an oven
example: bake a cake
ili: i30052
lexfile: verb.creation
part of speech: verb
hypernym: 01656555-v

02761440-v
type: LexicalConcept
in scheme: en-word.net
definition: be very hot, due to hot weather or exposure to the sun
example: The town was broiling in the sun
example: the tourists were baking in the heat
ili: i35458
lexfile: verb.stative
part of speech: verb
hypernym: 02609706-v