bacillus-n
type: LexicalEntry
canonical form: bacillus
sense: 01352589-n
part of speech: noun

B-n
type: LexicalEntry
canonical form: B
sense: 01352589-n
part of speech: noun

01352589-n
type: LexicalConcept
in scheme: en-word.net
definition: aerobic rod-shaped spore-producing bacterium; often occurring in chainlike formations; found primarily in soil
ili: i42423
lexfile: noun.animal
part of speech: noun
hypernym: 01357967-n