autotype-n
type: LexicalEntry
canonical form: autotype
sense: 13457534-n
part of speech: noun

autotypy-n
type: LexicalEntry
canonical form: autotypy
sense: 13457534-n
part of speech: noun

13457534-n
type: LexicalConcept
in scheme: en-word.net
definition: process for producing permanent prints in a carbon pigment
ili: i107354
lexfile: noun.process
part of speech: noun
hypernym: 13557997-n