auction-n
type: LexicalEntry
canonical form: auction
sense: 00093186-n
part of speech: noun
sense: 00492172-n

auction sale-n
type: LexicalEntry
canonical form: auction sale
sense: 00093186-n
part of speech: noun

vendue-n
type: LexicalEntry
canonical form: vendue
sense: 00093186-n
part of speech: noun

00093186-n
type: LexicalConcept
in scheme: en-word.net
definition: the public sale of something to the highest bidder
ili: i35890
lexfile: noun.act
part of speech: noun
hypernym: 01119862-n

auction bridge-n
type: LexicalEntry
canonical form: auction bridge
sense: 00492172-n
part of speech: noun

00492172-n
type: LexicalConcept
in scheme: en-word.net
definition: a variety of bridge in which tricks made in excess of the contract are scored toward game; now generally superseded by contract bridge
ili: i37961
lexfile: noun.act
part of speech: noun
hypernym: 00491580-n

auction-v
type: LexicalEntry
canonical form: auction
sense: 02249555-v
part of speech: verb

auction off-v
type: LexicalEntry
canonical form: auction off
sense: 02249555-v
part of speech: verb

auctioneer-v
type: LexicalEntry
canonical form: auctioneer
sense: 02249555-v
part of speech: verb

02249555-v
type: LexicalConcept
in scheme: en-word.net
definition: sell at an auction
ili: i32962
lexfile: verb.possession
part of speech: verb
domain topic: 01092370-n
hypernym: 02247246-v