attendance-n
type: LexicalEntry
canonical form: attendance
sense: 01235962-n
part of speech: noun
sense: 08201981-n
sense: 15310217-n

attending-n
type: LexicalEntry
canonical form: attending
sense: 01235962-n
part of speech: noun

01235962-n
type: LexicalConcept
in scheme: en-word.net
definition: the act of being present (at a meeting or event etc.)
ili: i41855
lexfile: noun.act
part of speech: noun
hypernym: 01082290-n

08201981-n
type: LexicalConcept
in scheme: en-word.net
definition: the number of people that are present
example: attendance was up by 50 per cent
ili: i80159
lexfile: noun.group
part of speech: noun
hypernym: 08201779-n

15310217-n
type: LexicalConcept
in scheme: en-word.net
definition: the frequency with which a person is present
example: a student's attendance is an important factor in her grade
ili: i117578
lexfile: noun.time
part of speech: noun
hypernym: 15303267-n