atomic power-n
type: LexicalEntry
canonical form: atomic power
sense: 11446239-n
part of speech: noun

nuclear power-n
type: LexicalEntry
canonical form: nuclear power
sense: 11446239-n
part of speech: noun

11446239-n
type: LexicalConcept
in scheme: en-word.net
definition: nuclear energy regarded as a source of electricity for the power grid (for civilian use)
ili: i97628
lexfile: noun.phenomenon
part of speech: noun
hypernym: 11446103-n