atheistic-a
type: LexicalEntry
canonical form: atheistic
sense: 01788744-s
part of speech: adjective
sense: https://en-word.net/lemma/atheistic-a#02837382-a

atheistical-a
type: LexicalEntry
canonical form: atheistical
sense: 01788744-s
part of speech: adjective
sense: https://en-word.net/lemma/atheistical-a#02837382-a

unbelieving-a
type: LexicalEntry
canonical form: unbelieving
sense: 01788744-s
part of speech: adjective

01788744-s
type: LexicalConcept
in scheme: en-word.net
definition: rejecting any belief in gods
ili: i9789
lexfile: adj.all
part of speech: adjective satellite
similar: https://en-word.net/synset/01788544-a

atheist-a
type: LexicalEntry
canonical form: atheist
sense: https://en-word.net/lemma/atheist-a#02837382-a
part of speech: adjective

https://en-word.net/synset/02837382-a
type: LexicalConcept
in scheme: en-word.net
definition: related to or characterized by or given to atheism
example: atheist leanings
ili: i16027
lexfile: adj.pert
part of speech: adjective