soccer-n
type: LexicalEntry
canonical form: soccer
sense: 00479273-n
part of speech: noun

association football-n
type: LexicalEntry
canonical form: association football
sense: 00479273-n
part of speech: noun

00479273-n
type: LexicalConcept
in scheme: en-word.net
definition: a football game in which two teams of 11 players try to kick or head a ball into the opponents' goal
ili: i37904
lexfile: noun.act
part of speech: noun
hypernym: 00469555-n
mero part: 01267426-n