assassinate-v
type: LexicalEntry
canonical form: assassinate
sense: 00848838-v
part of speech: verb
sense: 02488589-v

00848838-v
type: LexicalConcept
in scheme: en-word.net
definition: destroy or damage seriously, as of someone's reputation
example: He assassinated his enemy's character
ili: i25874
lexfile: verb.communication
part of speech: verb
hypernym: 00848188-v

02488589-v
type: LexicalConcept
in scheme: en-word.net
definition: murder; especially of socially prominent persons
example: Anwar Sadat was assassinated because many people did not like his peace politics with Israel
ili: i34133
lexfile: verb.social
part of speech: verb
exemplifies: 06730109-n
hypernym: 01326622-v