anxiety-n
type: LexicalEntry
canonical form: anxiety
sense: 07539144-n
part of speech: noun
sense: 14397837-n

07539144-n
type: LexicalConcept
in scheme: en-word.net
definition: a vague unpleasant emotion that is experienced in anticipation of some (usually ill-defined) misfortune
ili: i76293
lexfile: noun.feeling
part of speech: noun
hypernym: 07495208-n

anxiousness-n
type: LexicalEntry
canonical form: anxiousness
sense: 14397837-n
part of speech: noun

14397837-n
type: LexicalConcept
in scheme: en-word.net
definition: (psychiatry) a relatively permanent state of worry and nervousness occurring in a variety of mental disorders, usually accompanied by compulsive behavior or attacks of panic
ili: i112540
lexfile: noun.state
part of speech: noun
domain topic: 06065477-n
hypernym: 14396987-n