ambulate-v
type: LexicalEntry
canonical form: ambulate
sense: 01915691-v
part of speech: verb

01915691-v
type: LexicalConcept
in scheme: en-word.net
definition: walk about; not be bedridden or incapable of walking
ili: i31273
lexfile: verb.motion
part of speech: verb
hypernym: 01908923-v