alveolar arch-n
type: LexicalEntry
canonical form: alveolar arch
sense: 05317731-n
part of speech: noun

05317731-n
type: LexicalConcept
in scheme: en-word.net
definition: the part of the upper or lower jawbones in which the teeth are set
ili: i64864
lexfile: noun.body
part of speech: noun
hypernym: 05477841-n