alert-n
type: LexicalEntry
canonical form: alert
sense: 07239434-n
part of speech: noun

alerting-n
type: LexicalEntry
canonical form: alerting
sense: 07239434-n
part of speech: noun
sense: 14059525-n

07239434-n
type: LexicalConcept
in scheme: en-word.net
definition: a warning serves to make you more alert to danger
ili: i74627
lexfile: noun.communication
part of speech: noun
hypernym: 07238811-n

alertness-n
type: LexicalEntry
canonical form: alertness
sense: 14059525-n
part of speech: noun

14059525-n
type: LexicalConcept
in scheme: en-word.net
definition: a state of readiness to respond
example: alerting was indicated by the desynchronization of the EEG
ili: i110689
lexfile: noun.state
part of speech: noun
hypernym: 14047468-n