aggressive-a
type: LexicalEntry
canonical form: aggressive
sense: https://en-word.net/lemma/aggressive-a#00082711-a
part of speech: adjective
sense: 01247720-s
sense: 01358991-s

https://en-word.net/synset/00082711-a
type: LexicalConcept
in scheme: en-word.net
definition: having or showing determination and energetic pursuit of your ends
example: an aggressive businessman
example: an aggressive basketball player
example: he was aggressive and imperious; positive in his convictions
example: aggressive drivers
ili: i437
lexfile: adj.all
part of speech: adjective
also: https://en-word.net/synset/00157368-a
also: https://en-word.net/synset/01247284-a
also: https://en-word.net/synset/01633007-a
similar: 00083236-s
similar: 00083473-s
similar: 00083766-s
similar: 00083948-s
similar: 00084218-s
similar: 00084345-s
similar: 00084491-s
similar: 00084822-s
similar: 00085130-s
similar: 00085264-s

belligerent-a
type: LexicalEntry
canonical form: belligerent
sense: 01247720-s
part of speech: adjective

01247720-s
type: LexicalConcept
in scheme: en-word.net
definition: characteristic of an enemy or one eager to fight
example: aggressive acts against another country
example: a belligerent tone
ili: i6812
lexfile: adj.all
part of speech: adjective satellite
similar: https://en-word.net/synset/01247284-a

fast-growing-a
type: LexicalEntry
canonical form: fast-growing
sense: 01358991-s
part of speech: adjective

strong-growing-a
type: LexicalEntry
canonical form: strong-growing
sense: 01358991-s
part of speech: adjective

01358991-s
type: LexicalConcept
in scheme: en-word.net
definition: tending to spread quickly
example: an aggressive tumor
ili: i7385
lexfile: adj.all
part of speech: adjective satellite
similar: https://en-word.net/synset/01358814-a