agglutinate-a
type: LexicalEntry
canonical form: agglutinate
sense: 00053394-s
part of speech: adjective

agglutinative-a
type: LexicalEntry
canonical form: agglutinative
sense: 00053394-s
part of speech: adjective
sense: 00112829-s

00053394-s
type: LexicalConcept
in scheme: en-word.net
definition: united as if by glue
ili: i273
lexfile: adj.all
part of speech: adjective satellite
similar: https://en-word.net/synset/00052912-a

polysynthetic-a
type: LexicalEntry
canonical form: polysynthetic
sense: 00112829-s
part of speech: adjective

00112829-s
type: LexicalConcept
in scheme: en-word.net
definition: forming derivative or compound words by putting together constituents each of which expresses a single definite meaning
ili: i594
lexfile: adj.all
part of speech: adjective satellite
similar: https://en-word.net/synset/00112667-a