agglutinate-a
type: LexicalEntry
canonical form: agglutinate
sense: 00053394-s
part of speech: adjective

agglutinative-a
type: LexicalEntry
canonical form: agglutinative
sense: 00053394-s
part of speech: adjective

00053394-s
type: LexicalConcept
in scheme: en-word.net
definition: united as if by glue
ili: i273
lexfile: adj.all
part of speech: adjective satellite
similar: https://en-word.net/synset/00052912-a

agglutinate-v
type: LexicalEntry
canonical form: agglutinate
sense: 01224248-v
part of speech: verb
sense: 01224580-v

01224248-v
type: LexicalConcept
in scheme: en-word.net
definition: clump together; as of bacteria, red blood cells, etc.
ili: i27730
lexfile: verb.contact
part of speech: verb
hypernym: 01223449-v

01224580-v
type: LexicalConcept
in scheme: en-word.net
definition: string together (morphemes in an agglutinating language)
ili: i27732
lexfile: verb.contact
part of speech: verb
hypernym: 01293025-v